{"text_format":"1","workbook":"xlsx","n_sheets":7,"sheets":["1_Instrucoes","2_Analise_SHE","3_Resultados_Globais","4_Advertencias e pontuacoes","defs triangulos","defs_ordenacao","3_Pontuação_Global_Substâncias"],"not_rendered":{"charts":43,"images":2,"macros":1,"external_links":0,"defined_names":0,"comments":0,"pivot_tables":0},"unopened":[],"bounds":{"document_bytes":16777216,"sheet_cells":100000,"rows_first":2000,"rows_last":500,"rows_between":2000,"halvings":0,"cell_chars":16384,"cell_head_chars":4096},"cells_cut":0,"cells_raw":0,"read":"whole","date_system":"1900"}

{"sheet":"1_Instrucoes","index":0,"n_rows":3,"n_cols":2,"rows_kept":3,"cut":false,"hidden":false,"merged":[[1,1,1,13],[2,1,2,13]]}
[]
[null,"Excel para cálculo automático da ferramenta SHE para substâncias químicas e atividades laboratoriais"]
[null,"v1.0"]

{"sheet":"2_Analise_SHE","index":1,"n_rows":407,"n_cols":23,"rows_kept":407,"cut":false,"hidden":false,"merged":[[4,12,4,13],[4,16,4,17],[4,20,4,21],[1,12,2,22],[1,2,2,9],[1,10,2,10],[4,4,4,10],[389,9,389,10],[369,9,369,10],[349,9,349,10],[348,4,348,10],[368,4,368,10],[369,7,369,8],[349,7,349,8],[388,4,388,10],[389,7,389,8],[328,4,328,10],[329,7,329,8],[329,9,329,10],[308,4,308,10],[309,7,309,8],[309,9,309,10],[288,4,288,10],[289,7,289,8],[289,9,289,10],[268,4,268,10],[269,7,269,8],[269,9,269,10],[248,4,248,10],[249,7,249,8],[249,9,249,10],[228,4,228,10],[229,7,229,8],[229,9,229,10],[208,4,208,10],[209,7,209,8],[209,9,209,10],[188,4,188,10],[189,7,189,8],[189,9,189,10],[168,4,168,10],[169,7,169,8],[169,9,169,10],[148,4,148,10],[149,7,149,8],[149,9,149,10],[128,4,128,10],[129,7,129,8],[129,9,129,10],[108,4,108,10],[109,7,109,8],[109,9,109,10],[88,4,88,10],[89,7,89,8],[89,9,89,10],[67,4,67,10],[68,7,68,8],[68,9,68,10],[5,7,5,8],[5,9,5,10],[46,4,46,10],[47,7,47,8],[47,9,47,10],[25,4,25,10],[26,7,26,8],[26,9,26,10]]}
[]
[null,null,"Tabela 1. Pontuação dos perigos das substâncias, Triângulo SHE (TSHE) e Espetro de perigos potenciais (EPP) de cada substância.",null,null,null,null,null,null,null,"Clicar para apagar TODOS\nos dados inseridos.",null,"Tabela 2. Critérios para classificação dos perigos de substâncias de acordo com o Sistema Global Harmonizado de Classificação e Rotulagem de substâncias e misturas (GHS), regulamentação (CE) n.º  1272/2008"]
[]
[]
[null,null,"S1","1-Metilimidazol",null,null,null,null,null,null,null,null,"Perigos",null,"p",null,"Perigos",null,"p",null,"Perigos",null,"p"]
[null,null,"Código de perigo","Advertência de perigo","S","H","E","Triângulo SHE (TSHE)",null,"Espetro de perigos potenciais (EPP)",null,null,"H200","Físico",2,null,"H300","Saúde",2,null,"H400","Ambiente",2]
[null,null,"H302",{"$f":"IF(C7=\"\",\"\",VLOOKUP(C7,Tabela7[],2,0))","v":"Nocivo por ingestão"},{"$f":"IF(C7=\"\",\"\",VLOOKUP(C7,Tabela7[],3,0))","v":0},{"$f":"IF(C7=\"\",\"\",VLOOKUP(C7,Tabela7[],4,0))","v":1},{"$f":"IF(C7=\"\",\"\",VLOOKUP(C7,Tabela7[],5,0))","v":0},null,null,null,null,null,"H201","Físico",2,null,"H301","Saúde",2,null,"H401","Ambiente",2]
[null,null,"H311",{"$f":"IF(C8=\"\",\"\",VLOOKUP(C8,Tabela7[],2,0))","v":"Tóxico em contacto com a pele"},{"$f":"IF(C8=\"\",\"\",VLOOKUP(C8,Tabela7[],3,0))","v":0},{"$f":"IF(C8=\"\",\"\",VLOOKUP(C8,Tabela7[],4,0))","v":2},{"$f":"IF(C8=\"\",\"\",VLOOKUP(C8,Tabela7[],5,0))","v":0},null,null,null,null,null,"H202","Físico",2,null,"H302","Saúde",1,null,"H402","Ambiente",1]
[null,null,"H314",{"$f":"IF(C9=\"\",\"\",VLOOKUP(C9,Tabela7[],2,0))","v":"Provoca queimaduras na pele e lesões oculares graves"},{"$f":"IF(C9=\"\",\"\",VLOOKUP(C9,Tabela7[],3,0))","v":0},{"$f":"IF(C9=\"\",\"\",VLOOKUP(C9,Tabela7[],4,0))","v":2},{"$f":"IF(C9=\"\",\"\",VLOOKUP(C9,Tabela7[],5,0))","v":0},null,null,null,null,null,"H203","Físico",2,null,"H303","Saúde",1,null,"H410","Ambiente",2]
[null,null,"H412",{"$f":"IF(C10=\"\",\"\",VLOOKUP(C10,Tabela7[],2,0))","v":"Nocivo para os organismos aquáticos com efeitos duradouros"},{"$f":"IF(C10=\"\",\"\",VLOOKUP(C10,Tabela7[],3,0))","v":0},{"$f":"IF(C10=\"\",\"\",VLOOKUP(C10,Tabela7[],4,0))","v":0},{"$f":"IF(C10=\"\",\"\",VLOOKUP(C10,Tabela7[],5,0))","v":1},null,null,null,null,null,"H204:","Físico",1,null,"H304","Saúde",2,null,"H411","Ambiente",2]
[null,null,null,{"$f":"IF(C11=\"\",\"\",VLOOKUP(C11,Tabela7[],2,0))","v":""},{"$f":"IF(C11=\"\",\"\",VLOOKUP(C11,Tabela7[],3,0))","v":""},{"$f":"IF(C11=\"\",\"\",VLOOKUP(C11,Tabela7[],4,0))","v":""},{"$f":"IF(C11=\"\",\"\",VLOOKUP(C11,Tabela7[],5,0))","v":""},null,null,null,null,null,"H205","Físico",2,null,"H305","Saúde",1,null,"H412","Ambiente",1]
[null,null,null,{"$f":"IF(C12=\"\",\"\",VLOOKUP(C12,Tabela7[],2,0))","v":""},{"$f":"IF(C12=\"\",\"\",VLOOKUP(C12,Tabela7[],3,0))","v":""},{"$f":"IF(C12=\"\",\"\",VLOOKUP(C12,Tabela7[],4,0))","v":""},{"$f":"IF(C12=\"\",\"\",VLOOKUP(C12,Tabela7[],5,0))","v":""},null,null,null,null,null,"H206","Físico",2,null,"H310","Saúde",2,null,"H413","Ambiente",1]
[null,null,null,{"$f":"IF(C13=\"\",\"\",VLOOKUP(C13,Tabela7[],2,0))","v":""},{"$f":"IF(C13=\"\",\"\",VLOOKUP(C13,Tabela7[],3,0))","v":""},{"$f":"IF(C13=\"\",\"\",VLOOKUP(C13,Tabela7[],4,0))","v":""},{"$f":"IF(C13=\"\",\"\",VLOOKUP(C13,Tabela7[],5,0))","v":""},null,null,null,null,null,"H207","Físico",2,null,"H311","Saúde",2,null,"H420","Ambiente",2]
[null,null,null,{"$f":"IF(C14=\"\",\"\",VLOOKUP(C14,Tabela7[],2,0))","v":""},{"$f":"IF(C14=\"\",\"\",VLOOKUP(C14,Tabela7[],3,0))","v":""},{"$f":"IF(C14=\"\",\"\",VLOOKUP(C14,Tabela7[],4,0))","v":""},{"$f":"IF(C14=\"\",\"\",VLOOKUP(C14,Tabela7[],5,0))","v":""},null,null,null,null,null,"H208","Físico",2,null,"H312","Saúde",1,null,"EUH059","Ambiente",2]
[null,null,null,{"$f":"IF(C15=\"\",\"\",VLOOKUP(C15,Tabela7[],2,0))","v":""},{"$f":"IF(C15=\"\",\"\",VLOOKUP(C15,Tabela7[],3,0))","v":""},{"$f":"IF(C15=\"\",\"\",VLOOKUP(C15,Tabela7[],4,0))","v":""},{"$f":"IF(C15=\"\",\"\",VLOOKUP(C15,Tabela7[],5,0))","v":""},null,null,null,null,null,"H220","Físico",2,null,"H313","Saúde",1]
[null,null,null,{"$f":"IF(C16=\"\",\"\",VLOOKUP(C16,Tabela7[],2,0))","v":""},{"$f":"IF(C16=\"\",\"\",VLOOKUP(C16,Tabela7[],3,0))","v":""},{"$f":"IF(C16=\"\",\"\",VLOOKUP(C16,Tabela7[],4,0))","v":""},{"$f":"IF(C16=\"\",\"\",VLOOKUP(C16,Tabela7[],5,0))","v":""},null,null,null,null,null,"H221","Físico",1,null,"H314","Saúde",2]
[null,null,null,{"$f":"IF(C17=\"\",\"\",VLOOKUP(C17,Tabela7[],2,0))","v":""},{"$f":"IF(C17=\"\",\"\",VLOOKUP(C17,Tabela7[],3,0))","v":""},{"$f":"IF(C17=\"\",\"\",VLOOKUP(C17,Tabela7[],4,0))","v":""},{"$f":"IF(C17=\"\",\"\",VLOOKUP(C17,Tabela7[],5,0))","v":""},null,null,null,null,null,"H222","Físico",2,null,"H315","Saúde",1]
[null,null,null,{"$f":"IF(C18=\"\",\"\",VLOOKUP(C18,Tabela7[],2,0))","v":""},{"$f":"IF(C18=\"\",\"\",VLOOKUP(C18,Tabela7[],3,0))","v":""},{"$f":"IF(C18=\"\",\"\",VLOOKUP(C18,Tabela7[],4,0))","v":""},{"$f":"IF(C18=\"\",\"\",VLOOKUP(C18,Tabela7[],5,0))","v":""},null,null,null,null,null,"H223","Físico",1,null,"H316","Saúde",1]
[null,null,null,{"$f":"IF(C19=\"\",\"\",VLOOKUP(C19,Tabela7[],2,0))","v":""},{"$f":"IF(C19=\"\",\"\",VLOOKUP(C19,Tabela7[],3,0))","v":""},{"$f":"IF(C19=\"\",\"\",VLOOKUP(C19,Tabela7[],4,0))","v":""},{"$f":"IF(C19=\"\",\"\",VLOOKUP(C19,Tabela7[],5,0))","v":""},null,null,null,null,null,"H224","Físico",2,null,"H317","Saúde",1]
[null,null,null,{"$f":"IF(C20=\"\",\"\",VLOOKUP(C20,Tabela7[],2,0))","v":""},{"$f":"IF(C20=\"\",\"\",VLOOKUP(C20,Tabela7[],3,0))","v":""},{"$f":"IF(C20=\"\",\"\",VLOOKUP(C20,Tabela7[],4,0))","v":""},{"$f":"IF(C20=\"\",\"\",VLOOKUP(C20,Tabela7[],5,0))","v":""},null,null,null,null,null,"H225","Físico",2,null,"H318","Saúde",2]
[null,null,null,{"$f":"IF(C21=\"\",\"\",VLOOKUP(C21,Tabela7[],2,0))","v":""},{"$f":"IF(C21=\"\",\"\",VLOOKUP(C21,Tabela7[],3,0))","v":""},{"$f":"IF(C21=\"\",\"\",VLOOKUP(C21,Tabela7[],4,0))","v":""},{"$f":"IF(C21=\"\",\"\",VLOOKUP(C21,Tabela7[],5,0))","v":""},null,null,null,null,null,"H226","Físico",1,null,"H319","Saúde",1]
[null,null,"TOTAL",null,{"$f":"MAX(E7:E21)","v":0},2,{"$f":"MAX(G7:G21)","v":1},null,null,null,null,null,"H227","Físico",1,null,"H320","Saúde",1]
[null,null,"Cor",null,null,null,null,null,null,null,null,null,"H228 (cat. 1)","Físico",2,null,"H330","Saúde",2]
[null,null,null,null,null,null,null,null,null,null,null,null,"H228 (cat. 2)","Físico",1,null,"H331","Saúde",2]
[null,null,null,null,null,null,null,null,null,null,null,null,"H229","Físico",1,null,"H332","Saúde",1]
[null,null,"S2","1-Clorohexano",null,null,null,null,null,null,null,null,"H230","Físico",2,null,"H333","Saúde",1]
[null,null,"Código de perigo","Advertência de perigo","S","H","E","Triângulo SHE (TSHE)",null,"Espetro de perigos potenciais (EPP)",null,null,"H231","Físico",1,null,"H334","Saúde",2]
[null,null,"H226",{"$f":"IF(C28=\"\",\"\",VLOOKUP(C28,Tabela7[],2,0))","v":"Líquido e vapor inflamáveis"},{"$f":"IF(C28=\"\",\"\",VLOOKUP(C28,Tabela7[],3,0))","v":1},{"$f":"IF(C28=\"\",\"\",VLOOKUP(C28,Tabela7[],4,0))","v":0},{"$f":"IF(C28=\"\",\"\",VLOOKUP(C28,Tabela7[],5,0))","v":0},null,null,null,null,null,"H232","Físico",2,null,"H335","Saúde",1]
[null,null,null,{"$f":"IF(C29=\"\",\"\",VLOOKUP(C29,Tabela7[],2,0))","v":""},{"$f":"IF(C29=\"\",\"\",VLOOKUP(C29,Tabela7[],3,0))","v":""},{"$f":"IF(C29=\"\",\"\",VLOOKUP(C29,Tabela7[],4,0))","v":""},{"$f":"IF(C29=\"\",\"\",VLOOKUP(C29,Tabela7[],5,0))","v":""},null,null,null,null,null,"H240","Físico",2,null,"H336","Saúde",1]
[null,null,null,{"$f":"IF(C30=\"\",\"\",VLOOKUP(C30,Tabela7[],2,0))","v":""},{"$f":"IF(C30=\"\",\"\",VLOOKUP(C30,Tabela7[],3,0))","v":""},{"$f":"IF(C30=\"\",\"\",VLOOKUP(C30,Tabela7[],4,0))","v":""},{"$f":"IF(C30=\"\",\"\",VLOOKUP(C30,Tabela7[],5,0))","v":""},null,null,null,null,null,"H241","Físico",2,null,"H340","Saúde",2]
[null,null,null,{"$f":"IF(C31=\"\",\"\",VLOOKUP(C31,Tabela7[],2,0))","v":""},{"$f":"IF(C31=\"\",\"\",VLOOKUP(C31,Tabela7[],3,0))","v":""},{"$f":"IF(C31=\"\",\"\",VLOOKUP(C31,Tabela7[],4,0))","v":""},{"$f":"IF(C31=\"\",\"\",VLOOKUP(C31,Tabela7[],5,0))","v":""},null,null,null,null,null,"H242 (Tipo C & D)","Físico",2,null,"H341","Saúde",2]
[null,null,null,{"$f":"IF(C32=\"\",\"\",VLOOKUP(C32,Tabela7[],2,0))","v":""},{"$f":"IF(C32=\"\",\"\",VLOOKUP(C32,Tabela7[],3,0))","v":""},{"$f":"IF(C32=\"\",\"\",VLOOKUP(C32,Tabela7[],4,0))","v":""},{"$f":"IF(C32=\"\",\"\",VLOOKUP(C32,Tabela7[],5,0))","v":""},null,null,null,null,null,"H242 (Tipo E & F)","Físico",1,null,"H350","Saúde",2]
[null,null,null,{"$f":"IF(C33=\"\",\"\",VLOOKUP(C33,Tabela7[],2,0))","v":""},{"$f":"IF(C33=\"\",\"\",VLOOKUP(C33,Tabela7[],3,0))","v":""},{"$f":"IF(C33=\"\",\"\",VLOOKUP(C33,Tabela7[],4,0))","v":""},{"$f":"IF(C33=\"\",\"\",VLOOKUP(C33,Tabela7[],5,0))","v":""},null,null,null,null,null,"H250","Físico",2,null,"H351","Saúde",2]
[null,null,null,{"$f":"IF(C34=\"\",\"\",VLOOKUP(C34,Tabela7[],2,0))","v":""},{"$f":"IF(C34=\"\",\"\",VLOOKUP(C34,Tabela7[],3,0))","v":""},{"$f":"IF(C34=\"\",\"\",VLOOKUP(C34,Tabela7[],4,0))","v":""},{"$f":"IF(C34=\"\",\"\",VLOOKUP(C34,Tabela7[],5,0))","v":""},null,null,null,null,null,"H251","Físico",2,null,"H360","Saúde",2]
[null,null,null,{"$f":"IF(C35=\"\",\"\",VLOOKUP(C35,Tabela7[],2,0))","v":""},{"$f":"IF(C35=\"\",\"\",VLOOKUP(C35,Tabela7[],3,0))","v":""},{"$f":"IF(C35=\"\",\"\",VLOOKUP(C35,Tabela7[],4,0))","v":""},{"$f":"IF(C35=\"\",\"\",VLOOKUP(C35,Tabela7[],5,0))","v":""},null,null,null,null,null,"H252","Físico",1,null,"H361","Saúde",2]
[null,null,null,{"$f":"IF(C36=\"\",\"\",VLOOKUP(C36,Tabela7[],2,0))","v":""},{"$f":"IF(C36=\"\",\"\",VLOOKUP(C36,Tabela7[],3,0))","v":""},{"$f":"IF(C36=\"\",\"\",VLOOKUP(C36,Tabela7[],4,0))","v":""},{"$f":"IF(C36=\"\",\"\",VLOOKUP(C36,Tabela7[],5,0))","v":""},null,null,null,null,null,"H260","Físico",2,null,"H362","Saúde",1]
[null,null,null,{"$f":"IF(C37=\"\",\"\",VLOOKUP(C37,Tabela7[],2,0))","v":""},{"$f":"IF(C37=\"\",\"\",VLOOKUP(C37,Tabela7[],3,0))","v":""},{"$f":"IF(C37=\"\",\"\",VLOOKUP(C37,Tabela7[],4,0))","v":""},{"$f":"IF(C37=\"\",\"\",VLOOKUP(C37,Tabela7[],5,0))","v":""},null,null,null,null,null,"H261 (cat. 2)","Físico",2,null,"H370","Saúde",2]
[null,null,null,{"$f":"IF(C38=\"\",\"\",VLOOKUP(C38,Tabela7[],2,0))","v":""},{"$f":"IF(C38=\"\",\"\",VLOOKUP(C38,Tabela7[],3,0))","v":""},{"$f":"IF(C38=\"\",\"\",VLOOKUP(C38,Tabela7[],4,0))","v":""},{"$f":"IF(C38=\"\",\"\",VLOOKUP(C38,Tabela7[],5,0))","v":""},null,null,null,null,null,"H261 (cat. 3)","Físico",1,null,"H371","Saúde",2]
[null,null,null,{"$f":"IF(C39=\"\",\"\",VLOOKUP(C39,Tabela7[],2,0))","v":""},{"$f":"IF(C39=\"\",\"\",VLOOKUP(C39,Tabela7[],3,0))","v":""},{"$f":"IF(C39=\"\",\"\",VLOOKUP(C39,Tabela7[],4,0))","v":""},{"$f":"IF(C39=\"\",\"\",VLOOKUP(C39,Tabela7[],5,0))","v":""},null,null,null,null,null,"H270","Físico",2,null,"H372","Saúde",2]
[null,null,null,{"$f":"IF(C40=\"\",\"\",VLOOKUP(C40,Tabela7[],2,0))","v":""},{"$f":"IF(C40=\"\",\"\",VLOOKUP(C40,Tabela7[],3,0))","v":""},{"$f":"IF(C40=\"\",\"\",VLOOKUP(C40,Tabela7[],4,0))","v":""},{"$f":"IF(C40=\"\",\"\",VLOOKUP(C40,Tabela7[],5,0))","v":""},null,null,null,null,null,"H271","Físico",2,null,"H373","Saúde",2]
[null,null,null,{"$f":"IF(C41=\"\",\"\",VLOOKUP(C41,Tabela7[],2,0))","v":""},{"$f":"IF(C41=\"\",\"\",VLOOKUP(C41,Tabela7[],3,0))","v":""},{"$f":"IF(C41=\"\",\"\",VLOOKUP(C41,Tabela7[],4,0))","v":""},{"$f":"IF(C41=\"\",\"\",VLOOKUP(C41,Tabela7[],5,0))","v":""},null,null,null,null,null,"H272 (cat. 2)","Físico",2,null,"EUH029","Saúde",2]
[null,null,null,{"$f":"IF(C42=\"\",\"\",VLOOKUP(C42,Tabela7[],2,0))","v":""},{"$f":"IF(C42=\"\",\"\",VLOOKUP(C42,Tabela7[],3,0))","v":""},{"$f":"IF(C42=\"\",\"\",VLOOKUP(C42,Tabela7[],4,0))","v":""},{"$f":"IF(C42=\"\",\"\",VLOOKUP(C42,Tabela7[],5,0))","v":""},null,null,null,null,null,"H272 (cat. 3)","Físico",1,null,"EUH031","Saúde",2]
[null,null,"TOTAL",null,{"$f":"MAX(E28:E42)","v":1},{"$f":"MAX(F28:F42)","v":0},0,null,null,null,null,null,"H280","Físico",1,null,"EUH032","Saúde",2]
[null,null,"Cor",null,null,null,null,null,null,null,null,null,"H281","Físico",1,null,"EUH066","Saúde",1]
[null,null,null,null,null,null,null,null,null,null,null,null,"H290","Físico",1,null,"EUH070","Saúde",2]
[null,null,null,null,null,null,null,null,null,null,null,null,"EUH001","Físico",2,null,"EUH071","Saúde",2]
[null,null,"S3","Éter dietílico",null,null,null,null,null,null,null,null,"EUH006","Físico",2,null,"EUH201","Saúde",2]
[null,null,"Código de perigo","Advertência de perigo","S","H","E","Triângulo SHE (TSHE)",null,"Espetro de perigos potenciais (EPP)",null,null,"EUH014","Físico",2,null,"EUH201A","Saúde",1]
[null,null,"H224",{"$f":"IF(C49=\"\",\"\",VLOOKUP(C49,Tabela7[],2,0))","v":"Líquido e vapor extremamente inflamáveis"},{"$f":"IF(C49=\"\",\"\",VLOOKUP(C49,Tabela7[],3,0))","v":2},{"$f":"IF(C49=\"\",\"\",VLOOKUP(C49,Tabela7[],4,0))","v":0},{"$f":"IF(C49=\"\",\"\",VLOOKUP(C49,Tabela7[],5,0))","v":0},null,null,null,null,null,"EUH018","Físico",2,null,"EUH202","Saúde",2]
[null,null,"EUH019",{"$f":"IF(C50=\"\",\"\",VLOOKUP(C50,Tabela7[],2,0))","v":"Pode formar peróxidos explosivos"},{"$f":"IF(C50=\"\",\"\",VLOOKUP(C50,Tabela7[],3,0))","v":2},{"$f":"IF(C50=\"\",\"\",VLOOKUP(C50,Tabela7[],4,0))","v":0},{"$f":"IF(C50=\"\",\"\",VLOOKUP(C50,Tabela7[],5,0))","v":0},null,null,null,null,null,"EUH019","Físico",2,null,"EUH203","Saúde",1]
[null,null,"H302",{"$f":"IF(C51=\"\",\"\",VLOOKUP(C51,Tabela7[],2,0))","v":"Nocivo por ingestão"},{"$f":"IF(C51=\"\",\"\",VLOOKUP(C51,Tabela7[],3,0))","v":0},{"$f":"IF(C51=\"\",\"\",VLOOKUP(C51,Tabela7[],4,0))","v":1},{"$f":"IF(C51=\"\",\"\",VLOOKUP(C51,Tabela7[],5,0))","v":0},null,null,null,null,null,"EUH209","Físico",2,null,"EUH204","Saúde",1]
[null,null,"H336",{"$f":"IF(C52=\"\",\"\",VLOOKUP(C52,Tabela7[],2,0))","v":"Pode provocar sonolência ou vertigens"},{"$f":"IF(C52=\"\",\"\",VLOOKUP(C52,Tabela7[],3,0))","v":0},{"$f":"IF(C52=\"\",\"\",VLOOKUP(C52,Tabela7[],4,0))","v":1},{"$f":"IF(C52=\"\",\"\",VLOOKUP(C52,Tabela7[],5,0))","v":0},null,null,null,null,null,"EUH209A","Físico",1,null,"EUH205","Saúde",1]
[null,null,"EUH066",{"$f":"IF(C53=\"\",\"\",VLOOKUP(C53,Tabela7[],2,0))","v":"Pode provocar pele seca ou gretada por exposição repetida"},{"$f":"IF(C53=\"\",\"\",VLOOKUP(C53,Tabela7[],3,0))","v":0},{"$f":"IF(C53=\"\",\"\",VLOOKUP(C53,Tabela7[],4,0))","v":1},{"$f":"IF(C53=\"\",\"\",VLOOKUP(C53,Tabela7[],5,0))","v":0},null,null,null,null,null,"EUH044","Físico",2,null,"EUH206","Saúde",2]
[null,null,null,{"$f":"IF(C54=\"\",\"\",VLOOKUP(C54,Tabela7[],2,0))","v":""},{"$f":"IF(C54=\"\",\"\",VLOOKUP(C54,Tabela7[],3,0))","v":""},{"$f":"IF(C54=\"\",\"\",VLOOKUP(C54,Tabela7[],4,0))","v":""},{"$f":"IF(C54=\"\",\"\",VLOOKUP(C54,Tabela7[],5,0))","v":""},null,null,null,null,null,null,null,null,null,"EUH207","Saúde",2]
[null,null,null,{"$f":"IF(C55=\"\",\"\",VLOOKUP(C55,Tabela7[],2,0))","v":""},{"$f":"IF(C55=\"\",\"\",VLOOKUP(C55,Tabela7[],3,0))","v":""},{"$f":"IF(C55=\"\",\"\",VLOOKUP(C55,Tabela7[],4,0))","v":""},{"$f":"IF(C55=\"\",\"\",VLOOKUP(C55,Tabela7[],5,0))","v":""},null,null,null,null,null,null,null,null,null,"EUH208","Saúde",1]
[null,null,null,{"$f":"IF(C56=\"\",\"\",VLOOKUP(C56,Tabela7[],2,0))","v":""},{"$f":"IF(C56=\"\",\"\",VLOOKUP(C56,Tabela7[],3,0))","v":""},{"$f":"IF(C56=\"\",\"\",VLOOKUP(C56,Tabela7[],4,0))","v":""},{"$f":"IF(C56=\"\",\"\",VLOOKUP(C56,Tabela7[],5,0))","v":""}]
[null,null,null,{"$f":"IF(C57=\"\",\"\",VLOOKUP(C57,Tabela7[],2,0))","v":""},{"$f":"IF(C57=\"\",\"\",VLOOKUP(C57,Tabela7[],3,0))","v":""},{"$f":"IF(C57=\"\",\"\",VLOOKUP(C57,Tabela7[],4,0))","v":""},{"$f":"IF(C57=\"\",\"\",VLOOKUP(C57,Tabela7[],5,0))","v":""}]
[null,null,null,{"$f":"IF(C58=\"\",\"\",VLOOKUP(C58,Tabela7[],2,0))","v":""},{"$f":"IF(C58=\"\",\"\",VLOOKUP(C58,Tabela7[],3,0))","v":""},{"$f":"IF(C58=\"\",\"\",VLOOKUP(C58,Tabela7[],4,0))","v":""},{"$f":"IF(C58=\"\",\"\",VLOOKUP(C58,Tabela7[],5,0))","v":""}]
[null,null,null,{"$f":"IF(C59=\"\",\"\",VLOOKUP(C59,Tabela7[],2,0))","v":""},{"$f":"IF(C59=\"\",\"\",VLOOKUP(C59,Tabela7[],3,0))","v":""},{"$f":"IF(C59=\"\",\"\",VLOOKUP(C59,Tabela7[],4,0))","v":""},{"$f":"IF(C59=\"\",\"\",VLOOKUP(C59,Tabela7[],5,0))","v":""}]
[null,null,null,{"$f":"IF(C60=\"\",\"\",VLOOKUP(C60,Tabela7[],2,0))","v":""},{"$f":"IF(C60=\"\",\"\",VLOOKUP(C60,Tabela7[],3,0))","v":""},{"$f":"IF(C60=\"\",\"\",VLOOKUP(C60,Tabela7[],4,0))","v":""},{"$f":"IF(C60=\"\",\"\",VLOOKUP(C60,Tabela7[],5,0))","v":""}]
[null,null,null,{"$f":"IF(C61=\"\",\"\",VLOOKUP(C61,Tabela7[],2,0))","v":""},{"$f":"IF(C61=\"\",\"\",VLOOKUP(C61,Tabela7[],3,0))","v":""},{"$f":"IF(C61=\"\",\"\",VLOOKUP(C61,Tabela7[],4,0))","v":""},{"$f":"IF(C61=\"\",\"\",VLOOKUP(C61,Tabela7[],5,0))","v":""}]
[null,null,null,{"$f":"IF(C62=\"\",\"\",VLOOKUP(C62,Tabela7[],2,0))","v":""},{"$f":"IF(C62=\"\",\"\",VLOOKUP(C62,Tabela7[],3,0))","v":""},{"$f":"IF(C62=\"\",\"\",VLOOKUP(C62,Tabela7[],4,0))","v":""},{"$f":"IF(C62=\"\",\"\",VLOOKUP(C62,Tabela7[],5,0))","v":""}]
[null,null,null,{"$f":"IF(C63=\"\",\"\",VLOOKUP(C63,Tabela7[],2,0))","v":""},{"$f":"IF(C63=\"\",\"\",VLOOKUP(C63,Tabela7[],3,0))","v":""},{"$f":"IF(C63=\"\",\"\",VLOOKUP(C63,Tabela7[],4,0))","v":""},{"$f":"IF(C63=\"\",\"\",VLOOKUP(C63,Tabela7[],5,0))","v":""}]
[null,null,"TOTAL",null,{"$f":"MAX(E49:E63)","v":2},{"$f":"MAX(F49:F63)","v":1},0]
[null,null,"Cor"]
[]
[]
[null,null,"S4","Cloreto de 1-hexil-3-metilimidazólio"]
[null,null,"Código de perigo","Advertência de perigo","S","H","E","Triângulo SHE (TSHE)",null,"Espetro de perigos potenciais (EPP)"]
[null,null,null,{"$f":"IF(C70=\"\",\"\",VLOOKUP(C70,Tabela7[],2,0))","v":""},{"$f":"IF(C70=\"\",\"\",VLOOKUP(C70,Tabela7[],3,0))","v":""},{"$f":"IF(C70=\"\",\"\",VLOOKUP(C70,Tabela7[],4,0))","v":""},{"$f":"IF(C70=\"\",\"\",VLOOKUP(C70,Tabela7[],5,0))","v":""}]
[null,null,null,{"$f":"IF(C71=\"\",\"\",VLOOKUP(C71,Tabela7[],2,0))","v":""},{"$f":"IF(C71=\"\",\"\",VLOOKUP(C71,Tabela7[],3,0))","v":""},{"$f":"IF(C71=\"\",\"\",VLOOKUP(C71,Tabela7[],4,0))","v":""},{"$f":"IF(C71=\"\",\"\",VLOOKUP(C71,Tabela7[],5,0))","v":""}]
[null,null,null,{"$f":"IF(C72=\"\",\"\",VLOOKUP(C72,Tabela7[],2,0))","v":""},{"$f":"IF(C72=\"\",\"\",VLOOKUP(C72,Tabela7[],3,0))","v":""},{"$f":"IF(C72=\"\",\"\",VLOOKUP(C72,Tabela7[],4,0))","v":""},{"$f":"IF(C72=\"\",\"\",VLOOKUP(C72,Tabela7[],5,0))","v":""}]
[null,null,null,{"$f":"IF(C73=\"\",\"\",VLOOKUP(C73,Tabela7[],2,0))","v":""},{"$f":"IF(C73=\"\",\"\",VLOOKUP(C73,Tabela7[],3,0))","v":""},{"$f":"IF(C73=\"\",\"\",VLOOKUP(C73,Tabela7[],4,0))","v":""},{"$f":"IF(C73=\"\",\"\",VLOOKUP(C73,Tabela7[],5,0))","v":""}]
[null,null,null,{"$f":"IF(C74=\"\",\"\",VLOOKUP(C74,Tabela7[],2,0))","v":""},{"$f":"IF(C74=\"\",\"\",VLOOKUP(C74,Tabela7[],3,0))","v":""},{"$f":"IF(C74=\"\",\"\",VLOOKUP(C74,Tabela7[],4,0))","v":""},{"$f":"IF(C74=\"\",\"\",VLOOKUP(C74,Tabela7[],5,0))","v":""}]
[null,null,null,{"$f":"IF(C75=\"\",\"\",VLOOKUP(C75,Tabela7[],2,0))","v":""},{"$f":"IF(C75=\"\",\"\",VLOOKUP(C75,Tabela7[],3,0))","v":""},{"$f":"IF(C75=\"\",\"\",VLOOKUP(C75,Tabela7[],4,0))","v":""},{"$f":"IF(C75=\"\",\"\",VLOOKUP(C75,Tabela7[],5,0))","v":""}]
[null,null,null,{"$f":"IF(C76=\"\",\"\",VLOOKUP(C76,Tabela7[],2,0))","v":""},{"$f":"IF(C76=\"\",\"\",VLOOKUP(C76,Tabela7[],3,0))","v":""},{"$f":"IF(C76=\"\",\"\",VLOOKUP(C76,Tabela7[],4,0))","v":""},{"$f":"IF(C76=\"\",\"\",VLOOKUP(C76,Tabela7[],5,0))","v":""}]
[null,null,null,{"$f":"IF(C77=\"\",\"\",VLOOKUP(C77,Tabela7[],2,0))","v":""},{"$f":"IF(C77=\"\",\"\",VLOOKUP(C77,Tabela7[],3,0))","v":""},{"$f":"IF(C77=\"\",\"\",VLOOKUP(C77,Tabela7[],4,0))","v":""},{"$f":"IF(C77=\"\",\"\",VLOOKUP(C77,Tabela7[],5,0))","v":""}]
[null,null,null,{"$f":"IF(C78=\"\",\"\",VLOOKUP(C78,Tabela7[],2,0))","v":""},{"$f":"IF(C78=\"\",\"\",VLOOKUP(C78,Tabela7[],3,0))","v":""},{"$f":"IF(C78=\"\",\"\",VLOOKUP(C78,Tabela7[],4,0))","v":""},{"$f":"IF(C78=\"\",\"\",VLOOKUP(C78,Tabela7[],5,0))","v":""}]
[null,null,null,{"$f":"IF(C79=\"\",\"\",VLOOKUP(C79,Tabela7[],2,0))","v":""},{"$f":"IF(C79=\"\",\"\",VLOOKUP(C79,Tabela7[],3,0))","v":""},{"$f":"IF(C79=\"\",\"\",VLOOKUP(C79,Tabela7[],4,0))","v":""},{"$f":"IF(C79=\"\",\"\",VLOOKUP(C79,Tabela7[],5,0))","v":""}]
[null,null,null,{"$f":"IF(C80=\"\",\"\",VLOOKUP(C80,Tabela7[],2,0))","v":""},{"$f":"IF(C80=\"\",\"\",VLOOKUP(C80,Tabela7[],3,0))","v":""},{"$f":"IF(C80=\"\",\"\",VLOOKUP(C80,Tabela7[],4,0))","v":""},{"$f":"IF(C80=\"\",\"\",VLOOKUP(C80,Tabela7[],5,0))","v":""}]
[null,null,null,{"$f":"IF(C81=\"\",\"\",VLOOKUP(C81,Tabela7[],2,0))","v":""},{"$f":"IF(C81=\"\",\"\",VLOOKUP(C81,Tabela7[],3,0))","v":""},{"$f":"IF(C81=\"\",\"\",VLOOKUP(C81,Tabela7[],4,0))","v":""},{"$f":"IF(C81=\"\",\"\",VLOOKUP(C81,Tabela7[],5,0))","v":""}]
[null,null,null,{"$f":"IF(C82=\"\",\"\",VLOOKUP(C82,Tabela7[],2,0))","v":""},{"$f":"IF(C82=\"\",\"\",VLOOKUP(C82,Tabela7[],3,0))","v":""},{"$f":"IF(C82=\"\",\"\",VLOOKUP(C82,Tabela7[],4,0))","v":""},{"$f":"IF(C82=\"\",\"\",VLOOKUP(C82,Tabela7[],5,0))","v":""}]
[null,null,null,{"$f":"IF(C83=\"\",\"\",VLOOKUP(C83,Tabela7[],2,0))","v":""},{"$f":"IF(C83=\"\",\"\",VLOOKUP(C83,Tabela7[],3,0))","v":""},{"$f":"IF(C83=\"\",\"\",VLOOKUP(C83,Tabela7[],4,0))","v":""},{"$f":"IF(C83=\"\",\"\",VLOOKUP(C83,Tabela7[],5,0))","v":""}]
[null,null,null,{"$f":"IF(C84=\"\",\"\",VLOOKUP(C84,Tabela7[],2,0))","v":""},{"$f":"IF(C84=\"\",\"\",VLOOKUP(C84,Tabela7[],3,0))","v":""},{"$f":"IF(C84=\"\",\"\",VLOOKUP(C84,Tabela7[],4,0))","v":""},{"$f":"IF(C84=\"\",\"\",VLOOKUP(C84,Tabela7[],5,0))","v":""}]
[null,null,"TOTAL",null,{"$f":"MAX(E70:E84)","v":0},{"$f":"MAX(F70:F84)","v":0},0]
[null,null,"Cor"]
[]
[]
[null,null,"S5"]
[null,null,"Código de perigo","Advertência de perigo","S","H","E","Triângulo SHE (TSHE)",null,"Espetro de perigos potenciais (EPP)"]
[null,null,null,{"$f":"IF(C91=\"\",\"\",VLOOKUP(C91,Tabela7[],2,0))","v":""},{"$f":"IF(C91=\"\",\"\",VLOOKUP(C91,Tabela7[],3,0))","v":""},{"$f":"IF(C91=\"\",\"\",VLOOKUP(C91,Tabela7[],4,0))","v":""},{"$f":"IF(C91=\"\",\"\",VLOOKUP(C91,Tabela7[],5,0))","v":""}]
[null,null,null,{"$f":"IF(C92=\"\",\"\",VLOOKUP(C92,Tabela7[],2,0))","v":""},{"$f":"IF(C92=\"\",\"\",VLOOKUP(C92,Tabela7[],3,0))","v":""},{"$f":"IF(C92=\"\",\"\",VLOOKUP(C92,Tabela7[],4,0))","v":""},{"$f":"IF(C92=\"\",\"\",VLOOKUP(C92,Tabela7[],5,0))","v":""}]
[null,null,null,{"$f":"IF(C93=\"\",\"\",VLOOKUP(C93,Tabela7[],2,0))","v":""},{"$f":"IF(C93=\"\",\"\",VLOOKUP(C93,Tabela7[],3,0))","v":""},{"$f":"IF(C93=\"\",\"\",VLOOKUP(C93,Tabela7[],4,0))","v":""},{"$f":"IF(C93=\"\",\"\",VLOOKUP(C93,Tabela7[],5,0))","v":""}]
[null,null,null,{"$f":"IF(C94=\"\",\"\",VLOOKUP(C94,Tabela7[],2,0))","v":""},{"$f":"IF(C94=\"\",\"\",VLOOKUP(C94,Tabela7[],3,0))","v":""},{"$f":"IF(C94=\"\",\"\",VLOOKUP(C94,Tabela7[],4,0))","v":""},{"$f":"IF(C94=\"\",\"\",VLOOKUP(C94,Tabela7[],5,0))","v":""}]
[null,null,null,{"$f":"IF(C95=\"\",\"\",VLOOKUP(C95,Tabela7[],2,0))","v":""},{"$f":"IF(C95=\"\",\"\",VLOOKUP(C95,Tabela7[],3,0))","v":""},{"$f":"IF(C95=\"\",\"\",VLOOKUP(C95,Tabela7[],4,0))","v":""},{"$f":"IF(C95=\"\",\"\",VLOOKUP(C95,Tabela7[],5,0))","v":""}]
[null,null,null,{"$f":"IF(C96=\"\",\"\",VLOOKUP(C96,Tabela7[],2,0))","v":""},{"$f":"IF(C96=\"\",\"\",VLOOKUP(C96,Tabela7[],3,0))","v":""},{"$f":"IF(C96=\"\",\"\",VLOOKUP(C96,Tabela7[],4,0))","v":""},{"$f":"IF(C96=\"\",\"\",VLOOKUP(C96,Tabela7[],5,0))","v":""}]
[null,null,null,{"$f":"IF(C97=\"\",\"\",VLOOKUP(C97,Tabela7[],2,0))","v":""},{"$f":"IF(C97=\"\",\"\",VLOOKUP(C97,Tabela7[],3,0))","v":""},{"$f":"IF(C97=\"\",\"\",VLOOKUP(C97,Tabela7[],4,0))","v":""},{"$f":"IF(C97=\"\",\"\",VLOOKUP(C97,Tabela7[],5,0))","v":""}]
[null,null,null,{"$f":"IF(C98=\"\",\"\",VLOOKUP(C98,Tabela7[],2,0))","v":""},{"$f":"IF(C98=\"\",\"\",VLOOKUP(C98,Tabela7[],3,0))","v":""},{"$f":"IF(C98=\"\",\"\",VLOOKUP(C98,Tabela7[],4,0))","v":""},{"$f":"IF(C98=\"\",\"\",VLOOKUP(C98,Tabela7[],5,0))","v":""}]
[null,null,null,{"$f":"IF(C99=\"\",\"\",VLOOKUP(C99,Tabela7[],2,0))","v":""},{"$f":"IF(C99=\"\",\"\",VLOOKUP(C99,Tabela7[],3,0))","v":""},{"$f":"IF(C99=\"\",\"\",VLOOKUP(C99,Tabela7[],4,0))","v":""},{"$f":"IF(C99=\"\",\"\",VLOOKUP(C99,Tabela7[],5,0))","v":""}]
[null,null,null,{"$f":"IF(C100=\"\",\"\",VLOOKUP(C100,Tabela7[],2,0))","v":""},{"$f":"IF(C100=\"\",\"\",VLOOKUP(C100,Tabela7[],3,0))","v":""},{"$f":"IF(C100=\"\",\"\",VLOOKUP(C100,Tabela7[],4,0))","v":""},{"$f":"IF(C100=\"\",\"\",VLOOKUP(C100,Tabela7[],5,0))","v":""}]
[null,null,null,{"$f":"IF(C101=\"\",\"\",VLOOKUP(C101,Tabela7[],2,0))","v":""},{"$f":"IF(C101=\"\",\"\",VLOOKUP(C101,Tabela7[],3,0))","v":""},{"$f":"IF(C101=\"\",\"\",VLOOKUP(C101,Tabela7[],4,0))","v":""},{"$f":"IF(C101=\"\",\"\",VLOOKUP(C101,Tabela7[],5,0))","v":""}]
[null,null,null,{"$f":"IF(C102=\"\",\"\",VLOOKUP(C102,Tabela7[],2,0))","v":""},{"$f":"IF(C102=\"\",\"\",VLOOKUP(C102,Tabela7[],3,0))","v":""},{"$f":"IF(C102=\"\",\"\",VLOOKUP(C102,Tabela7[],4,0))","v":""},{"$f":"IF(C102=\"\",\"\",VLOOKUP(C102,Tabela7[],5,0))","v":""}]
[null,null,null,{"$f":"IF(C103=\"\",\"\",VLOOKUP(C103,Tabela7[],2,0))","v":""},{"$f":"IF(C103=\"\",\"\",VLOOKUP(C103,Tabela7[],3,0))","v":""},{"$f":"IF(C103=\"\",\"\",VLOOKUP(C103,Tabela7[],4,0))","v":""},{"$f":"IF(C103=\"\",\"\",VLOOKUP(C103,Tabela7[],5,0))","v":""}]
[null,null,null,{"$f":"IF(C104=\"\",\"\",VLOOKUP(C104,Tabela7[],2,0))","v":""},{"$f":"IF(C104=\"\",\"\",VLOOKUP(C104,Tabela7[],3,0))","v":""},{"$f":"IF(C104=\"\",\"\",VLOOKUP(C104,Tabela7[],4,0))","v":""},{"$f":"IF(C104=\"\",\"\",VLOOKUP(C104,Tabela7[],5,0))","v":""}]
[null,null,null,{"$f":"IF(C105=\"\",\"\",VLOOKUP(C105,Tabela7[],2,0))","v":""},{"$f":"IF(C105=\"\",\"\",VLOOKUP(C105,Tabela7[],3,0))","v":""},{"$f":"IF(C105=\"\",\"\",VLOOKUP(C105,Tabela7[],4,0))","v":""},{"$f":"IF(C105=\"\",\"\",VLOOKUP(C105,Tabela7[],5,0))","v":""}]
[null,null,"TOTAL",null,{"$f":"MAX(E91:E105)","v":0},{"$f":"MAX(F91:F105)","v":0},0]
[null,null,"Cor"]
[]
[null,null,"S6"]
[null,null,"Código de perigo","Advertência de perigo","S","H","E","Triângulo SHE (TSHE)",null,"Espetro de perigos potenciais (EPP)"]
[null,null,null,{"$f":"IF(C111=\"\",\"\",VLOOKUP(C111,Tabela7[],2,0))","v":""},{"$f":"IF(C111=\"\",\"\",VLOOKUP(C111,Tabela7[],3,0))","v":""},{"$f":"IF(C111=\"\",\"\",VLOOKUP(C111,Tabela7[],4,0))","v":""},{"$f":"IF(C111=\"\",\"\",VLOOKUP(C111,Tabela7[],5,0))","v":""}]
[null,null,null,{"$f":"IF(C112=\"\",\"\",VLOOKUP(C112,Tabela7[],2,0))","v":""},{"$f":"IF(C112=\"\",\"\",VLOOKUP(C112,Tabela7[],3,0))","v":""},{"$f":"IF(C112=\"\",\"\",VLOOKUP(C112,Tabela7[],4,0))","v":""},{"$f":"IF(C112=\"\",\"\",VLOOKUP(C112,Tabela7[],5,0))","v":""}]
[null,null,null,{"$f":"IF(C113=\"\",\"\",VLOOKUP(C113,Tabela7[],2,0))","v":""},{"$f":"IF(C113=\"\",\"\",VLOOKUP(C113,Tabela7[],3,0))","v":""},{"$f":"IF(C113=\"\",\"\",VLOOKUP(C113,Tabela7[],4,0))","v":""},{"$f":"IF(C113=\"\",\"\",VLOOKUP(C113,Tabela7[],5,0))","v":""}]
[null,null,null,{"$f":"IF(C114=\"\",\"\",VLOOKUP(C114,Tabela7[],2,0))","v":""},{"$f":"IF(C114=\"\",\"\",VLOOKUP(C114,Tabela7[],3,0))","v":""},{"$f":"IF(C114=\"\",\"\",VLOOKUP(C114,Tabela7[],4,0))","v":""},{"$f":"IF(C114=\"\",\"\",VLOOKUP(C114,Tabela7[],5,0))","v":""}]
[null,null,null,{"$f":"IF(C115=\"\",\"\",VLOOKUP(C115,Tabela7[],2,0))","v":""},{"$f":"IF(C115=\"\",\"\",VLOOKUP(C115,Tabela7[],3,0))","v":""},{"$f":"IF(C115=\"\",\"\",VLOOKUP(C115,Tabela7[],4,0))","v":""},{"$f":"IF(C115=\"\",\"\",VLOOKUP(C115,Tabela7[],5,0))","v":""}]
[null,null,null,{"$f":"IF(C116=\"\",\"\",VLOOKUP(C116,Tabela7[],2,0))","v":""},{"$f":"IF(C116=\"\",\"\",VLOOKUP(C116,Tabela7[],3,0))","v":""},{"$f":"IF(C116=\"\",\"\",VLOOKUP(C116,Tabela7[],4,0))","v":""},{"$f":"IF(C116=\"\",\"\",VLOOKUP(C116,Tabela7[],5,0))","v":""}]
[null,null,null,{"$f":"IF(C117=\"\",\"\",VLOOKUP(C117,Tabela7[],2,0))","v":""},{"$f":"IF(C117=\"\",\"\",VLOOKUP(C117,Tabela7[],3,0))","v":""},{"$f":"IF(C117=\"\",\"\",VLOOKUP(C117,Tabela7[],4,0))","v":""},{"$f":"IF(C117=\"\",\"\",VLOOKUP(C117,Tabela7[],5,0))","v":""}]
[null,null,null,{"$f":"IF(C118=\"\",\"\",VLOOKUP(C118,Tabela7[],2,0))","v":""},{"$f":"IF(C118=\"\",\"\",VLOOKUP(C118,Tabela7[],3,0))","v":""},{"$f":"IF(C118=\"\",\"\",VLOOKUP(C118,Tabela7[],4,0))","v":""},{"$f":"IF(C118=\"\",\"\",VLOOKUP(C118,Tabela7[],5,0))","v":""}]
[null,null,null,{"$f":"IF(C119=\"\",\"\",VLOOKUP(C119,Tabela7[],2,0))","v":""},{"$f":"IF(C119=\"\",\"\",VLOOKUP(C119,Tabela7[],3,0))","v":""},{"$f":"IF(C119=\"\",\"\",VLOOKUP(C119,Tabela7[],4,0))","v":""},{"$f":"IF(C119=\"\",\"\",VLOOKUP(C119,Tabela7[],5,0))","v":""}]
[null,null,null,{"$f":"IF(C120=\"\",\"\",VLOOKUP(C120,Tabela7[],2,0))","v":""},{"$f":"IF(C120=\"\",\"\",VLOOKUP(C120,Tabela7[],3,0))","v":""},{"$f":"IF(C120=\"\",\"\",VLOOKUP(C120,Tabela7[],4,0))","v":""},{"$f":"IF(C120=\"\",\"\",VLOOKUP(C120,Tabela7[],5,0))","v":""}]
[null,null,null,{"$f":"IF(C121=\"\",\"\",VLOOKUP(C121,Tabela7[],2,0))","v":""},{"$f":"IF(C121=\"\",\"\",VLOOKUP(C121,Tabela7[],3,0))","v":""},{"$f":"IF(C121=\"\",\"\",VLOOKUP(C121,Tabela7[],4,0))","v":""},{"$f":"IF(C121=\"\",\"\",VLOOKUP(C121,Tabela7[],5,0))","v":""}]
[null,null,null,{"$f":"IF(C122=\"\",\"\",VLOOKUP(C122,Tabela7[],2,0))","v":""},{"$f":"IF(C122=\"\",\"\",VLOOKUP(C122,Tabela7[],3,0))","v":""},{"$f":"IF(C122=\"\",\"\",VLOOKUP(C122,Tabela7[],4,0))","v":""},{"$f":"IF(C122=\"\",\"\",VLOOKUP(C122,Tabela7[],5,0))","v":""}]
[null,null,null,{"$f":"IF(C123=\"\",\"\",VLOOKUP(C123,Tabela7[],2,0))","v":""},{"$f":"IF(C123=\"\",\"\",VLOOKUP(C123,Tabela7[],3,0))","v":""},{"$f":"IF(C123=\"\",\"\",VLOOKUP(C123,Tabela7[],4,0))","v":""},{"$f":"IF(C123=\"\",\"\",VLOOKUP(C123,Tabela7[],5,0))","v":""}]
[null,null,null,{"$f":"IF(C124=\"\",\"\",VLOOKUP(C124,Tabela7[],2,0))","v":""},{"$f":"IF(C124=\"\",\"\",VLOOKUP(C124,Tabela7[],3,0))","v":""},{"$f":"IF(C124=\"\",\"\",VLOOKUP(C124,Tabela7[],4,0))","v":""},{"$f":"IF(C124=\"\",\"\",VLOOKUP(C124,Tabela7[],5,0))","v":""}]
[null,null,null,{"$f":"IF(C125=\"\",\"\",VLOOKUP(C125,Tabela7[],2,0))","v":""},{"$f":"IF(C125=\"\",\"\",VLOOKUP(C125,Tabela7[],3,0))","v":""},{"$f":"IF(C125=\"\",\"\",VLOOKUP(C125,Tabela7[],4,0))","v":""},{"$f":"IF(C125=\"\",\"\",VLOOKUP(C125,Tabela7[],5,0))","v":""}]
[null,null,"TOTAL",null,{"$f":"MAX(E111:E125)","v":0},{"$f":"MAX(F111:F125)","v":0},0]
[null,null,"Cor"]
[]
[null,null,"S7"]
[null,null,"Código de perigo","Advertência de perigo","S","H","E","Triângulo SHE (TSHE)",null,"Espetro de perigos potenciais (EPP)"]
[null,null,null,{"$f":"IF(C131=\"\",\"\",VLOOKUP(C131,Tabela7[],2,0))","v":""},{"$f":"IF(C131=\"\",\"\",VLOOKUP(C131,Tabela7[],3,0))","v":""},{"$f":"IF(C131=\"\",\"\",VLOOKUP(C131,Tabela7[],4,0))","v":""},{"$f":"IF(C131=\"\",\"\",VLOOKUP(C131,Tabela7[],5,0))","v":""}]
[null,null,null,{"$f":"IF(C132=\"\",\"\",VLOOKUP(C132,Tabela7[],2,0))","v":""},{"$f":"IF(C132=\"\",\"\",VLOOKUP(C132,Tabela7[],3,0))","v":""},{"$f":"IF(C132=\"\",\"\",VLOOKUP(C132,Tabela7[],4,0))","v":""},{"$f":"IF(C132=\"\",\"\",VLOOKUP(C132,Tabela7[],5,0))","v":""}]
[null,null,null,{"$f":"IF(C133=\"\",\"\",VLOOKUP(C133,Tabela7[],2,0))","v":""},{"$f":"IF(C133=\"\",\"\",VLOOKUP(C133,Tabela7[],3,0))","v":""},{"$f":"IF(C133=\"\",\"\",VLOOKUP(C133,Tabela7[],4,0))","v":""},{"$f":"IF(C133=\"\",\"\",VLOOKUP(C133,Tabela7[],5,0))","v":""}]
[null,null,null,{"$f":"IF(C134=\"\",\"\",VLOOKUP(C134,Tabela7[],2,0))","v":""},{"$f":"IF(C134=\"\",\"\",VLOOKUP(C134,Tabela7[],3,0))","v":""},{"$f":"IF(C134=\"\",\"\",VLOOKUP(C134,Tabela7[],4,0))","v":""},{"$f":"IF(C134=\"\",\"\",VLOOKUP(C134,Tabela7[],5,0))","v":""}]
[null,null,null,{"$f":"IF(C135=\"\",\"\",VLOOKUP(C135,Tabela7[],2,0))","v":""},{"$f":"IF(C135=\"\",\"\",VLOOKUP(C135,Tabela7[],3,0))","v":""},{"$f":"IF(C135=\"\",\"\",VLOOKUP(C135,Tabela7[],4,0))","v":""},{"$f":"IF(C135=\"\",\"\",VLOOKUP(C135,Tabela7[],5,0))","v":""}]
[null,null,null,{"$f":"IF(C136=\"\",\"\",VLOOKUP(C136,Tabela7[],2,0))","v":""},{"$f":"IF(C136=\"\",\"\",VLOOKUP(C136,Tabela7[],3,0))","v":""},{"$f":"IF(C136=\"\",\"\",VLOOKUP(C136,Tabela7[],4,0))","v":""},{"$f":"IF(C136=\"\",\"\",VLOOKUP(C136,Tabela7[],5,0))","v":""}]
[null,null,null,{"$f":"IF(C137=\"\",\"\",VLOOKUP(C137,Tabela7[],2,0))","v":""},{"$f":"IF(C137=\"\",\"\",VLOOKUP(C137,Tabela7[],3,0))","v":""},{"$f":"IF(C137=\"\",\"\",VLOOKUP(C137,Tabela7[],4,0))","v":""},{"$f":"IF(C137=\"\",\"\",VLOOKUP(C137,Tabela7[],5,0))","v":""}]
[null,null,null,{"$f":"IF(C138=\"\",\"\",VLOOKUP(C138,Tabela7[],2,0))","v":""},{"$f":"IF(C138=\"\",\"\",VLOOKUP(C138,Tabela7[],3,0))","v":""},{"$f":"IF(C138=\"\",\"\",VLOOKUP(C138,Tabela7[],4,0))","v":""},{"$f":"IF(C138=\"\",\"\",VLOOKUP(C138,Tabela7[],5,0))","v":""}]
[null,null,null,{"$f":"IF(C139=\"\",\"\",VLOOKUP(C139,Tabela7[],2,0))","v":""},{"$f":"IF(C139=\"\",\"\",VLOOKUP(C139,Tabela7[],3,0))","v":""},{"$f":"IF(C139=\"\",\"\",VLOOKUP(C139,Tabela7[],4,0))","v":""},{"$f":"IF(C139=\"\",\"\",VLOOKUP(C139,Tabela7[],5,0))","v":""}]
[null,null,null,{"$f":"IF(C140=\"\",\"\",VLOOKUP(C140,Tabela7[],2,0))","v":""},{"$f":"IF(C140=\"\",\"\",VLOOKUP(C140,Tabela7[],3,0))","v":""},{"$f":"IF(C140=\"\",\"\",VLOOKUP(C140,Tabela7[],4,0))","v":""},{"$f":"IF(C140=\"\",\"\",VLOOKUP(C140,Tabela7[],5,0))","v":""}]
[null,null,null,{"$f":"IF(C141=\"\",\"\",VLOOKUP(C141,Tabela7[],2,0))","v":""},{"$f":"IF(C141=\"\",\"\",VLOOKUP(C141,Tabela7[],3,0))","v":""},{"$f":"IF(C141=\"\",\"\",VLOOKUP(C141,Tabela7[],4,0))","v":""},{"$f":"IF(C141=\"\",\"\",VLOOKUP(C141,Tabela7[],5,0))","v":""}]
[null,null,null,{"$f":"IF(C142=\"\",\"\",VLOOKUP(C142,Tabela7[],2,0))","v":""},{"$f":"IF(C142=\"\",\"\",VLOOKUP(C142,Tabela7[],3,0))","v":""},{"$f":"IF(C142=\"\",\"\",VLOOKUP(C142,Tabela7[],4,0))","v":""},{"$f":"IF(C142=\"\",\"\",VLOOKUP(C142,Tabela7[],5,0))","v":""}]
[null,null,null,{"$f":"IF(C143=\"\",\"\",VLOOKUP(C143,Tabela7[],2,0))","v":""},{"$f":"IF(C143=\"\",\"\",VLOOKUP(C143,Tabela7[],3,0))","v":""},{"$f":"IF(C143=\"\",\"\",VLOOKUP(C143,Tabela7[],4,0))","v":""},{"$f":"IF(C143=\"\",\"\",VLOOKUP(C143,Tabela7[],5,0))","v":""}]
[null,null,null,{"$f":"IF(C144=\"\",\"\",VLOOKUP(C144,Tabela7[],2,0))","v":""},{"$f":"IF(C144=\"\",\"\",VLOOKUP(C144,Tabela7[],3,0))","v":""},{"$f":"IF(C144=\"\",\"\",VLOOKUP(C144,Tabela7[],4,0))","v":""},{"$f":"IF(C144=\"\",\"\",VLOOKUP(C144,Tabela7[],5,0))","v":""}]
[null,null,null,{"$f":"IF(C145=\"\",\"\",VLOOKUP(C145,Tabela7[],2,0))","v":""},{"$f":"IF(C145=\"\",\"\",VLOOKUP(C145,Tabela7[],3,0))","v":""},{"$f":"IF(C145=\"\",\"\",VLOOKUP(C145,Tabela7[],4,0))","v":""},{"$f":"IF(C145=\"\",\"\",VLOOKUP(C145,Tabela7[],5,0))","v":""}]
[null,null,"TOTAL",null,{"$f":"MAX(E131:E145)","v":0},{"$f":"MAX(F131:F145)","v":0},0]
[null,null,"Cor"]
[]
[null,null,"S8"]
[null,null,"Código de perigo","Advertência de perigo","S","H","E","Triângulo SHE (TSHE)",null,"Espetro de perigos potenciais (EPP)"]
[null,null,null,{"$f":"IF(C151=\"\",\"\",VLOOKUP(C151,Tabela7[],2,0))","v":""},{"$f":"IF(C151=\"\",\"\",VLOOKUP(C151,Tabela7[],3,0))","v":""},{"$f":"IF(C151=\"\",\"\",VLOOKUP(C151,Tabela7[],4,0))","v":""},{"$f":"IF(C151=\"\",\"\",VLOOKUP(C151,Tabela7[],5,0))","v":""}]
[null,null,null,{"$f":"IF(C152=\"\",\"\",VLOOKUP(C152,Tabela7[],2,0))","v":""},{"$f":"IF(C152=\"\",\"\",VLOOKUP(C152,Tabela7[],3,0))","v":""},{"$f":"IF(C152=\"\",\"\",VLOOKUP(C152,Tabela7[],4,0))","v":""},{"$f":"IF(C152=\"\",\"\",VLOOKUP(C152,Tabela7[],5,0))","v":""}]
[null,null,null,{"$f":"IF(C153=\"\",\"\",VLOOKUP(C153,Tabela7[],2,0))","v":""},{"$f":"IF(C153=\"\",\"\",VLOOKUP(C153,Tabela7[],3,0))","v":""},{"$f":"IF(C153=\"\",\"\",VLOOKUP(C153,Tabela7[],4,0))","v":""},{"$f":"IF(C153=\"\",\"\",VLOOKUP(C153,Tabela7[],5,0))","v":""}]
[null,null,null,{"$f":"IF(C154=\"\",\"\",VLOOKUP(C154,Tabela7[],2,0))","v":""},{"$f":"IF(C154=\"\",\"\",VLOOKUP(C154,Tabela7[],3,0))","v":""},{"$f":"IF(C154=\"\",\"\",VLOOKUP(C154,Tabela7[],4,0))","v":""},{"$f":"IF(C154=\"\",\"\",VLOOKUP(C154,Tabela7[],5,0))","v":""}]
[null,null,null,{"$f":"IF(C155=\"\",\"\",VLOOKUP(C155,Tabela7[],2,0))","v":""},{"$f":"IF(C155=\"\",\"\",VLOOKUP(C155,Tabela7[],3,0))","v":""},{"$f":"IF(C155=\"\",\"\",VLOOKUP(C155,Tabela7[],4,0))","v":""},{"$f":"IF(C155=\"\",\"\",VLOOKUP(C155,Tabela7[],5,0))","v":""}]
[null,null,null,{"$f":"IF(C156=\"\",\"\",VLOOKUP(C156,Tabela7[],2,0))","v":""},{"$f":"IF(C156=\"\",\"\",VLOOKUP(C156,Tabela7[],3,0))","v":""},{"$f":"IF(C156=\"\",\"\",VLOOKUP(C156,Tabela7[],4,0))","v":""},{"$f":"IF(C156=\"\",\"\",VLOOKUP(C156,Tabela7[],5,0))","v":""}]
[null,null,null,{"$f":"IF(C157=\"\",\"\",VLOOKUP(C157,Tabela7[],2,0))","v":""},{"$f":"IF(C157=\"\",\"\",VLOOKUP(C157,Tabela7[],3,0))","v":""},{"$f":"IF(C157=\"\",\"\",VLOOKUP(C157,Tabela7[],4,0))","v":""},{"$f":"IF(C157=\"\",\"\",VLOOKUP(C157,Tabela7[],5,0))","v":""}]
[null,null,null,{"$f":"IF(C158=\"\",\"\",VLOOKUP(C158,Tabela7[],2,0))","v":""},{"$f":"IF(C158=\"\",\"\",VLOOKUP(C158,Tabela7[],3,0))","v":""},{"$f":"IF(C158=\"\",\"\",VLOOKUP(C158,Tabela7[],4,0))","v":""},{"$f":"IF(C158=\"\",\"\",VLOOKUP(C158,Tabela7[],5,0))","v":""}]
[null,null,null,{"$f":"IF(C159=\"\",\"\",VLOOKUP(C159,Tabela7[],2,0))","v":""},{"$f":"IF(C159=\"\",\"\",VLOOKUP(C159,Tabela7[],3,0))","v":""},{"$f":"IF(C159=\"\",\"\",VLOOKUP(C159,Tabela7[],4,0))","v":""},{"$f":"IF(C159=\"\",\"\",VLOOKUP(C159,Tabela7[],5,0))","v":""}]
[null,null,null,{"$f":"IF(C160=\"\",\"\",VLOOKUP(C160,Tabela7[],2,0))","v":""},{"$f":"IF(C160=\"\",\"\",VLOOKUP(C160,Tabela7[],3,0))","v":""},{"$f":"IF(C160=\"\",\"\",VLOOKUP(C160,Tabela7[],4,0))","v":""},{"$f":"IF(C160=\"\",\"\",VLOOKUP(C160,Tabela7[],5,0))","v":""}]
[null,null,null,{"$f":"IF(C161=\"\",\"\",VLOOKUP(C161,Tabela7[],2,0))","v":""},{"$f":"IF(C161=\"\",\"\",VLOOKUP(C161,Tabela7[],3,0))","v":""},{"$f":"IF(C161=\"\",\"\",VLOOKUP(C161,Tabela7[],4,0))","v":""},{"$f":"IF(C161=\"\",\"\",VLOOKUP(C161,Tabela7[],5,0))","v":""}]
[null,null,null,{"$f":"IF(C162=\"\",\"\",VLOOKUP(C162,Tabela7[],2,0))","v":""},{"$f":"IF(C162=\"\",\"\",VLOOKUP(C162,Tabela7[],3,0))","v":""},{"$f":"IF(C162=\"\",\"\",VLOOKUP(C162,Tabela7[],4,0))","v":""},{"$f":"IF(C162=\"\",\"\",VLOOKUP(C162,Tabela7[],5,0))","v":""}]
[null,null,null,{"$f":"IF(C163=\"\",\"\",VLOOKUP(C163,Tabela7[],2,0))","v":""},{"$f":"IF(C163=\"\",\"\",VLOOKUP(C163,Tabela7[],3,0))","v":""},{"$f":"IF(C163=\"\",\"\",VLOOKUP(C163,Tabela7[],4,0))","v":""},{"$f":"IF(C163=\"\",\"\",VLOOKUP(C163,Tabela7[],5,0))","v":""}]
[null,null,null,{"$f":"IF(C164=\"\",\"\",VLOOKUP(C164,Tabela7[],2,0))","v":""},{"$f":"IF(C164=\"\",\"\",VLOOKUP(C164,Tabela7[],3,0))","v":""},{"$f":"IF(C164=\"\",\"\",VLOOKUP(C164,Tabela7[],4,0))","v":""},{"$f":"IF(C164=\"\",\"\",VLOOKUP(C164,Tabela7[],5,0))","v":""}]
[null,null,null,{"$f":"IF(C165=\"\",\"\",VLOOKUP(C165,Tabela7[],2,0))","v":""},{"$f":"IF(C165=\"\",\"\",VLOOKUP(C165,Tabela7[],3,0))","v":""},{"$f":"IF(C165=\"\",\"\",VLOOKUP(C165,Tabela7[],4,0))","v":""},{"$f":"IF(C165=\"\",\"\",VLOOKUP(C165,Tabela7[],5,0))","v":""}]
[null,null,"TOTAL",null,{"$f":"MAX(E151:E165)","v":0},{"$f":"MAX(F151:F165)","v":0},0]
[null,null,"Cor"]
[]
[null,null,"S9"]
[null,null,"Código de perigo","Advertência de perigo","S","H","E","Triângulo SHE (TSHE)",null,"Espetro de perigos potenciais (EPP)"]
[null,null,null,{"$f":"IF(C171=\"\",\"\",VLOOKUP(C171,Tabela7[],2,0))","v":""},{"$f":"IF(C171=\"\",\"\",VLOOKUP(C171,Tabela7[],3,0))","v":""},{"$f":"IF(C171=\"\",\"\",VLOOKUP(C171,Tabela7[],4,0))","v":""},{"$f":"IF(C171=\"\",\"\",VLOOKUP(C171,Tabela7[],5,0))","v":""}]
[null,null,null,{"$f":"IF(C172=\"\",\"\",VLOOKUP(C172,Tabela7[],2,0))","v":""},{"$f":"IF(C172=\"\",\"\",VLOOKUP(C172,Tabela7[],3,0))","v":""},{"$f":"IF(C172=\"\",\"\",VLOOKUP(C172,Tabela7[],4,0))","v":""},{"$f":"IF(C172=\"\",\"\",VLOOKUP(C172,Tabela7[],5,0))","v":""}]
[null,null,null,{"$f":"IF(C173=\"\",\"\",VLOOKUP(C173,Tabela7[],2,0))","v":""},{"$f":"IF(C173=\"\",\"\",VLOOKUP(C173,Tabela7[],3,0))","v":""},{"$f":"IF(C173=\"\",\"\",VLOOKUP(C173,Tabela7[],4,0))","v":""},{"$f":"IF(C173=\"\",\"\",VLOOKUP(C173,Tabela7[],5,0))","v":""}]
[null,null,null,{"$f":"IF(C174=\"\",\"\",VLOOKUP(C174,Tabela7[],2,0))","v":""},{"$f":"IF(C174=\"\",\"\",VLOOKUP(C174,Tabela7[],3,0))","v":""},{"$f":"IF(C174=\"\",\"\",VLOOKUP(C174,Tabela7[],4,0))","v":""},{"$f":"IF(C174=\"\",\"\",VLOOKUP(C174,Tabela7[],5,0))","v":""}]
[null,null,null,{"$f":"IF(C175=\"\",\"\",VLOOKUP(C175,Tabela7[],2,0))","v":""},{"$f":"IF(C175=\"\",\"\",VLOOKUP(C175,Tabela7[],3,0))","v":""},{"$f":"IF(C175=\"\",\"\",VLOOKUP(C175,Tabela7[],4,0))","v":""},{"$f":"IF(C175=\"\",\"\",VLOOKUP(C175,Tabela7[],5,0))","v":""}]
[null,null,null,{"$f":"IF(C176=\"\",\"\",VLOOKUP(C176,Tabela7[],2,0))","v":""},{"$f":"IF(C176=\"\",\"\",VLOOKUP(C176,Tabela7[],3,0))","v":""},{"$f":"IF(C176=\"\",\"\",VLOOKUP(C176,Tabela7[],4,0))","v":""},{"$f":"IF(C176=\"\",\"\",VLOOKUP(C176,Tabela7[],5,0))","v":""}]
[null,null,null,{"$f":"IF(C177=\"\",\"\",VLOOKUP(C177,Tabela7[],2,0))","v":""},{"$f":"IF(C177=\"\",\"\",VLOOKUP(C177,Tabela7[],3,0))","v":""},{"$f":"IF(C177=\"\",\"\",VLOOKUP(C177,Tabela7[],4,0))","v":""},{"$f":"IF(C177=\"\",\"\",VLOOKUP(C177,Tabela7[],5,0))","v":""}]
[null,null,null,{"$f":"IF(C178=\"\",\"\",VLOOKUP(C178,Tabela7[],2,0))","v":""},{"$f":"IF(C178=\"\",\"\",VLOOKUP(C178,Tabela7[],3,0))","v":""},{"$f":"IF(C178=\"\",\"\",VLOOKUP(C178,Tabela7[],4,0))","v":""},{"$f":"IF(C178=\"\",\"\",VLOOKUP(C178,Tabela7[],5,0))","v":""}]
[null,null,null,{"$f":"IF(C179=\"\",\"\",VLOOKUP(C179,Tabela7[],2,0))","v":""},{"$f":"IF(C179=\"\",\"\",VLOOKUP(C179,Tabela7[],3,0))","v":""},{"$f":"IF(C179=\"\",\"\",VLOOKUP(C179,Tabela7[],4,0))","v":""},{"$f":"IF(C179=\"\",\"\",VLOOKUP(C179,Tabela7[],5,0))","v":""}]
[null,null,null,{"$f":"IF(C180=\"\",\"\",VLOOKUP(C180,Tabela7[],2,0))","v":""},{"$f":"IF(C180=\"\",\"\",VLOOKUP(C180,Tabela7[],3,0))","v":""},{"$f":"IF(C180=\"\",\"\",VLOOKUP(C180,Tabela7[],4,0))","v":""},{"$f":"IF(C180=\"\",\"\",VLOOKUP(C180,Tabela7[],5,0))","v":""}]
[null,null,null,{"$f":"IF(C181=\"\",\"\",VLOOKUP(C181,Tabela7[],2,0))","v":""},{"$f":"IF(C181=\"\",\"\",VLOOKUP(C181,Tabela7[],3,0))","v":""},{"$f":"IF(C181=\"\",\"\",VLOOKUP(C181,Tabela7[],4,0))","v":""},{"$f":"IF(C181=\"\",\"\",VLOOKUP(C181,Tabela7[],5,0))","v":""}]
[null,null,null,{"$f":"IF(C182=\"\",\"\",VLOOKUP(C182,Tabela7[],2,0))","v":""},{"$f":"IF(C182=\"\",\"\",VLOOKUP(C182,Tabela7[],3,0))","v":""},{"$f":"IF(C182=\"\",\"\",VLOOKUP(C182,Tabela7[],4,0))","v":""},{"$f":"IF(C182=\"\",\"\",VLOOKUP(C182,Tabela7[],5,0))","v":""}]
[null,null,null,{"$f":"IF(C183=\"\",\"\",VLOOKUP(C183,Tabela7[],2,0))","v":""},{"$f":"IF(C183=\"\",\"\",VLOOKUP(C183,Tabela7[],3,0))","v":""},{"$f":"IF(C183=\"\",\"\",VLOOKUP(C183,Tabela7[],4,0))","v":""},{"$f":"IF(C183=\"\",\"\",VLOOKUP(C183,Tabela7[],5,0))","v":""}]
[null,null,null,{"$f":"IF(C184=\"\",\"\",VLOOKUP(C184,Tabela7[],2,0))","v":""},{"$f":"IF(C184=\"\",\"\",VLOOKUP(C184,Tabela7[],3,0))","v":""},{"$f":"IF(C184=\"\",\"\",VLOOKUP(C184,Tabela7[],4,0))","v":""},{"$f":"IF(C184=\"\",\"\",VLOOKUP(C184,Tabela7[],5,0))","v":""}]
[null,null,null,{"$f":"IF(C185=\"\",\"\",VLOOKUP(C185,Tabela7[],2,0))","v":""},{"$f":"IF(C185=\"\",\"\",VLOOKUP(C185,Tabela7[],3,0))","v":""},{"$f":"IF(C185=\"\",\"\",VLOOKUP(C185,Tabela7[],4,0))","v":""},{"$f":"IF(C185=\"\",\"\",VLOOKUP(C185,Tabela7[],5,0))","v":""}]
[null,null,"TOTAL",null,{"$f":"MAX(E171:E185)","v":0},{"$f":"MAX(F171:F185)","v":0},0]
[null,null,"Cor"]
[]
[null,null,"S10"]
[null,null,"Código de perigo","Advertência de perigo","S","H","E","Triângulo SHE (TSHE)",null,"Espetro de perigos potenciais (EPP)"]
[null,null,null,{"$f":"IF(C191=\"\",\"\",VLOOKUP(C191,Tabela7[],2,0))","v":""},{"$f":"IF(C191=\"\",\"\",VLOOKUP(C191,Tabela7[],3,0))","v":""},{"$f":"IF(C191=\"\",\"\",VLOOKUP(C191,Tabela7[],4,0))","v":""},{"$f":"IF(C191=\"\",\"\",VLOOKUP(C191,Tabela7[],5,0))","v":""}]
[null,null,null,{"$f":"IF(C192=\"\",\"\",VLOOKUP(C192,Tabela7[],2,0))","v":""},{"$f":"IF(C192=\"\",\"\",VLOOKUP(C192,Tabela7[],3,0))","v":""},{"$f":"IF(C192=\"\",\"\",VLOOKUP(C192,Tabela7[],4,0))","v":""},{"$f":"IF(C192=\"\",\"\",VLOOKUP(C192,Tabela7[],5,0))","v":""}]
[null,null,null,{"$f":"IF(C193=\"\",\"\",VLOOKUP(C193,Tabela7[],2,0))","v":""},{"$f":"IF(C193=\"\",\"\",VLOOKUP(C193,Tabela7[],3,0))","v":""},{"$f":"IF(C193=\"\",\"\",VLOOKUP(C193,Tabela7[],4,0))","v":""},{"$f":"IF(C193=\"\",\"\",VLOOKUP(C193,Tabela7[],5,0))","v":""}]
[null,null,null,{"$f":"IF(C194=\"\",\"\",VLOOKUP(C194,Tabela7[],2,0))","v":""},{"$f":"IF(C194=\"\",\"\",VLOOKUP(C194,Tabela7[],3,0))","v":""},{"$f":"IF(C194=\"\",\"\",VLOOKUP(C194,Tabela7[],4,0))","v":""},{"$f":"IF(C194=\"\",\"\",VLOOKUP(C194,Tabela7[],5,0))","v":""}]
[null,null,null,{"$f":"IF(C195=\"\",\"\",VLOOKUP(C195,Tabela7[],2,0))","v":""},{"$f":"IF(C195=\"\",\"\",VLOOKUP(C195,Tabela7[],3,0))","v":""},{"$f":"IF(C195=\"\",\"\",VLOOKUP(C195,Tabela7[],4,0))","v":""},{"$f":"IF(C195=\"\",\"\",VLOOKUP(C195,Tabela7[],5,0))","v":""}]
[null,null,null,{"$f":"IF(C196=\"\",\"\",VLOOKUP(C196,Tabela7[],2,0))","v":""},{"$f":"IF(C196=\"\",\"\",VLOOKUP(C196,Tabela7[],3,0))","v":""},{"$f":"IF(C196=\"\",\"\",VLOOKUP(C196,Tabela7[],4,0))","v":""},{"$f":"IF(C196=\"\",\"\",VLOOKUP(C196,Tabela7[],5,0))","v":""}]
[null,null,null,{"$f":"IF(C197=\"\",\"\",VLOOKUP(C197,Tabela7[],2,0))","v":""},{"$f":"IF(C197=\"\",\"\",VLOOKUP(C197,Tabela7[],3,0))","v":""},{"$f":"IF(C197=\"\",\"\",VLOOKUP(C197,Tabela7[],4,0))","v":""},{"$f":"IF(C197=\"\",\"\",VLOOKUP(C197,Tabela7[],5,0))","v":""}]
[null,null,null,{"$f":"IF(C198=\"\",\"\",VLOOKUP(C198,Tabela7[],2,0))","v":""},{"$f":"IF(C198=\"\",\"\",VLOOKUP(C198,Tabela7[],3,0))","v":""},{"$f":"IF(C198=\"\",\"\",VLOOKUP(C198,Tabela7[],4,0))","v":""},{"$f":"IF(C198=\"\",\"\",VLOOKUP(C198,Tabela7[],5,0))","v":""}]
[null,null,null,{"$f":"IF(C199=\"\",\"\",VLOOKUP(C199,Tabela7[],2,0))","v":""},{"$f":"IF(C199=\"\",\"\",VLOOKUP(C199,Tabela7[],3,0))","v":""},{"$f":"IF(C199=\"\",\"\",VLOOKUP(C199,Tabela7[],4,0))","v":""},{"$f":"IF(C199=\"\",\"\",VLOOKUP(C199,Tabela7[],5,0))","v":""}]
[null,null,null,{"$f":"IF(C200=\"\",\"\",VLOOKUP(C200,Tabela7[],2,0))","v":""},{"$f":"IF(C200=\"\",\"\",VLOOKUP(C200,Tabela7[],3,0))","v":""},{"$f":"IF(C200=\"\",\"\",VLOOKUP(C200,Tabela7[],4,0))","v":""},{"$f":"IF(C200=\"\",\"\",VLOOKUP(C200,Tabela7[],5,0))","v":""}]
[null,null,null,{"$f":"IF(C201=\"\",\"\",VLOOKUP(C201,Tabela7[],2,0))","v":""},{"$f":"IF(C201=\"\",\"\",VLOOKUP(C201,Tabela7[],3,0))","v":""},{"$f":"IF(C201=\"\",\"\",VLOOKUP(C201,Tabela7[],4,0))","v":""},{"$f":"IF(C201=\"\",\"\",VLOOKUP(C201,Tabela7[],5,0))","v":""}]
[null,null,null,{"$f":"IF(C202=\"\",\"\",VLOOKUP(C202,Tabela7[],2,0))","v":""},{"$f":"IF(C202=\"\",\"\",VLOOKUP(C202,Tabela7[],3,0))","v":""},{"$f":"IF(C202=\"\",\"\",VLOOKUP(C202,Tabela7[],4,0))","v":""},{"$f":"IF(C202=\"\",\"\",VLOOKUP(C202,Tabela7[],5,0))","v":""}]
[null,null,null,{"$f":"IF(C203=\"\",\"\",VLOOKUP(C203,Tabela7[],2,0))","v":""},{"$f":"IF(C203=\"\",\"\",VLOOKUP(C203,Tabela7[],3,0))","v":""},{"$f":"IF(C203=\"\",\"\",VLOOKUP(C203,Tabela7[],4,0))","v":""},{"$f":"IF(C203=\"\",\"\",VLOOKUP(C203,Tabela7[],5,0))","v":""}]
[null,null,null,{"$f":"IF(C204=\"\",\"\",VLOOKUP(C204,Tabela7[],2,0))","v":""},{"$f":"IF(C204=\"\",\"\",VLOOKUP(C204,Tabela7[],3,0))","v":""},{"$f":"IF(C204=\"\",\"\",VLOOKUP(C204,Tabela7[],4,0))","v":""},{"$f":"IF(C204=\"\",\"\",VLOOKUP(C204,Tabela7[],5,0))","v":""}]
[null,null,null,{"$f":"IF(C205=\"\",\"\",VLOOKUP(C205,Tabela7[],2,0))","v":""},{"$f":"IF(C205=\"\",\"\",VLOOKUP(C205,Tabela7[],3,0))","v":""},{"$f":"IF(C205=\"\",\"\",VLOOKUP(C205,Tabela7[],4,0))","v":""},{"$f":"IF(C205=\"\",\"\",VLOOKUP(C205,Tabela7[],5,0))","v":""}]
[null,null,"TOTAL",null,{"$f":"MAX(E191:E205)","v":0},{"$f":"MAX(F191:F205)","v":0},0]
[null,null,"Cor"]
[]
[null,null,"S11"]
[null,null,"Código de perigo","Advertência de perigo","S","H","E","Triângulo SHE (TSHE)",null,"Espetro de perigos potenciais (EPP)"]
[null,null,null,{"$f":"IF(C211=\"\",\"\",VLOOKUP(C211,Tabela7[],2,0))","v":""},{"$f":"IF(C211=\"\",\"\",VLOOKUP(C211,Tabela7[],3,0))","v":""},{"$f":"IF(C211=\"\",\"\",VLOOKUP(C211,Tabela7[],4,0))","v":""},{"$f":"IF(C211=\"\",\"\",VLOOKUP(C211,Tabela7[],5,0))","v":""}]
[null,null,null,{"$f":"IF(C212=\"\",\"\",VLOOKUP(C212,Tabela7[],2,0))","v":""},{"$f":"IF(C212=\"\",\"\",VLOOKUP(C212,Tabela7[],3,0))","v":""},{"$f":"IF(C212=\"\",\"\",VLOOKUP(C212,Tabela7[],4,0))","v":""},{"$f":"IF(C212=\"\",\"\",VLOOKUP(C212,Tabela7[],5,0))","v":""}]
[null,null,null,{"$f":"IF(C213=\"\",\"\",VLOOKUP(C213,Tabela7[],2,0))","v":""},{"$f":"IF(C213=\"\",\"\",VLOOKUP(C213,Tabela7[],3,0))","v":""},{"$f":"IF(C213=\"\",\"\",VLOOKUP(C213,Tabela7[],4,0))","v":""},{"$f":"IF(C213=\"\",\"\",VLOOKUP(C213,Tabela7[],5,0))","v":""}]
[null,null,null,{"$f":"IF(C214=\"\",\"\",VLOOKUP(C214,Tabela7[],2,0))","v":""},{"$f":"IF(C214=\"\",\"\",VLOOKUP(C214,Tabela7[],3,0))","v":""},{"$f":"IF(C214=\"\",\"\",VLOOKUP(C214,Tabela7[],4,0))","v":""},{"$f":"IF(C214=\"\",\"\",VLOOKUP(C214,Tabela7[],5,0))","v":""}]
[null,null,null,{"$f":"IF(C215=\"\",\"\",VLOOKUP(C215,Tabela7[],2,0))","v":""},{"$f":"IF(C215=\"\",\"\",VLOOKUP(C215,Tabela7[],3,0))","v":""},{"$f":"IF(C215=\"\",\"\",VLOOKUP(C215,Tabela7[],4,0))","v":""},{"$f":"IF(C215=\"\",\"\",VLOOKUP(C215,Tabela7[],5,0))","v":""}]
[null,null,null,{"$f":"IF(C216=\"\",\"\",VLOOKUP(C216,Tabela7[],2,0))","v":""},{"$f":"IF(C216=\"\",\"\",VLOOKUP(C216,Tabela7[],3,0))","v":""},{"$f":"IF(C216=\"\",\"\",VLOOKUP(C216,Tabela7[],4,0))","v":""},{"$f":"IF(C216=\"\",\"\",VLOOKUP(C216,Tabela7[],5,0))","v":""}]
[null,null,null,{"$f":"IF(C217=\"\",\"\",VLOOKUP(C217,Tabela7[],2,0))","v":""},{"$f":"IF(C217=\"\",\"\",VLOOKUP(C217,Tabela7[],3,0))","v":""},{"$f":"IF(C217=\"\",\"\",VLOOKUP(C217,Tabela7[],4,0))","v":""},{"$f":"IF(C217=\"\",\"\",VLOOKUP(C217,Tabela7[],5,0))","v":""}]
[null,null,null,{"$f":"IF(C218=\"\",\"\",VLOOKUP(C218,Tabela7[],2,0))","v":""},{"$f":"IF(C218=\"\",\"\",VLOOKUP(C218,Tabela7[],3,0))","v":""},{"$f":"IF(C218=\"\",\"\",VLOOKUP(C218,Tabela7[],4,0))","v":""},{"$f":"IF(C218=\"\",\"\",VLOOKUP(C218,Tabela7[],5,0))","v":""}]
[null,null,null,{"$f":"IF(C219=\"\",\"\",VLOOKUP(C219,Tabela7[],2,0))","v":""},{"$f":"IF(C219=\"\",\"\",VLOOKUP(C219,Tabela7[],3,0))","v":""},{"$f":"IF(C219=\"\",\"\",VLOOKUP(C219,Tabela7[],4,0))","v":""},{"$f":"IF(C219=\"\",\"\",VLOOKUP(C219,Tabela7[],5,0))","v":""}]
[null,null,null,{"$f":"IF(C220=\"\",\"\",VLOOKUP(C220,Tabela7[],2,0))","v":""},{"$f":"IF(C220=\"\",\"\",VLOOKUP(C220,Tabela7[],3,0))","v":""},{"$f":"IF(C220=\"\",\"\",VLOOKUP(C220,Tabela7[],4,0))","v":""},{"$f":"IF(C220=\"\",\"\",VLOOKUP(C220,Tabela7[],5,0))","v":""}]
[null,null,null,{"$f":"IF(C221=\"\",\"\",VLOOKUP(C221,Tabela7[],2,0))","v":""},{"$f":"IF(C221=\"\",\"\",VLOOKUP(C221,Tabela7[],3,0))","v":""},{"$f":"IF(C221=\"\",\"\",VLOOKUP(C221,Tabela7[],4,0))","v":""},{"$f":"IF(C221=\"\",\"\",VLOOKUP(C221,Tabela7[],5,0))","v":""}]
[null,null,null,{"$f":"IF(C222=\"\",\"\",VLOOKUP(C222,Tabela7[],2,0))","v":""},{"$f":"IF(C222=\"\",\"\",VLOOKUP(C222,Tabela7[],3,0))","v":""},{"$f":"IF(C222=\"\",\"\",VLOOKUP(C222,Tabela7[],4,0))","v":""},{"$f":"IF(C222=\"\",\"\",VLOOKUP(C222,Tabela7[],5,0))","v":""}]
[null,null,null,{"$f":"IF(C223=\"\",\"\",VLOOKUP(C223,Tabela7[],2,0))","v":""},{"$f":"IF(C223=\"\",\"\",VLOOKUP(C223,Tabela7[],3,0))","v":""},{"$f":"IF(C223=\"\",\"\",VLOOKUP(C223,Tabela7[],4,0))","v":""},{"$f":"IF(C223=\"\",\"\",VLOOKUP(C223,Tabela7[],5,0))","v":""}]
[null,null,null,{"$f":"IF(C224=\"\",\"\",VLOOKUP(C224,Tabela7[],2,0))","v":""},{"$f":"IF(C224=\"\",\"\",VLOOKUP(C224,Tabela7[],3,0))","v":""},{"$f":"IF(C224=\"\",\"\",VLOOKUP(C224,Tabela7[],4,0))","v":""},{"$f":"IF(C224=\"\",\"\",VLOOKUP(C224,Tabela7[],5,0))","v":""}]
[null,null,null,{"$f":"IF(C225=\"\",\"\",VLOOKUP(C225,Tabela7[],2,0))","v":""},{"$f":"IF(C225=\"\",\"\",VLOOKUP(C225,Tabela7[],3,0))","v":""},{"$f":"IF(C225=\"\",\"\",VLOOKUP(C225,Tabela7[],4,0))","v":""},{"$f":"IF(C225=\"\",\"\",VLOOKUP(C225,Tabela7[],5,0))","v":""}]
[null,null,"TOTAL",null,{"$f":"MAX(E211:E225)","v":0},{"$f":"MAX(F211:F225)","v":0},0]
[null,null,"Cor"]
[]
[null,null,"S12"]
[null,null,"Código de perigo","Advertência de perigo","S","H","E","Triângulo SHE (TSHE)",null,"Espetro de perigos potenciais (EPP)"]
[null,null,null,{"$f":"IF(C231=\"\",\"\",VLOOKUP(C231,Tabela7[],2,0))","v":""},{"$f":"IF(C231=\"\",\"\",VLOOKUP(C231,Tabela7[],3,0))","v":""},{"$f":"IF(C231=\"\",\"\",VLOOKUP(C231,Tabela7[],4,0))","v":""},{"$f":"IF(C231=\"\",\"\",VLOOKUP(C231,Tabela7[],5,0))","v":""}]
[null,null,null,{"$f":"IF(C232=\"\",\"\",VLOOKUP(C232,Tabela7[],2,0))","v":""},{"$f":"IF(C232=\"\",\"\",VLOOKUP(C232,Tabela7[],3,0))","v":""},{"$f":"IF(C232=\"\",\"\",VLOOKUP(C232,Tabela7[],4,0))","v":""},{"$f":"IF(C232=\"\",\"\",VLOOKUP(C232,Tabela7[],5,0))","v":""}]
[null,null,null,{"$f":"IF(C233=\"\",\"\",VLOOKUP(C233,Tabela7[],2,0))","v":""},{"$f":"IF(C233=\"\",\"\",VLOOKUP(C233,Tabela7[],3,0))","v":""},{"$f":"IF(C233=\"\",\"\",VLOOKUP(C233,Tabela7[],4,0))","v":""},{"$f":"IF(C233=\"\",\"\",VLOOKUP(C233,Tabela7[],5,0))","v":""}]
[null,null,null,{"$f":"IF(C234=\"\",\"\",VLOOKUP(C234,Tabela7[],2,0))","v":""},{"$f":"IF(C234=\"\",\"\",VLOOKUP(C234,Tabela7[],3,0))","v":""},{"$f":"IF(C234=\"\",\"\",VLOOKUP(C234,Tabela7[],4,0))","v":""},{"$f":"IF(C234=\"\",\"\",VLOOKUP(C234,Tabela7[],5,0))","v":""}]
[null,null,null,{"$f":"IF(C235=\"\",\"\",VLOOKUP(C235,Tabela7[],2,0))","v":""},{"$f":"IF(C235=\"\",\"\",VLOOKUP(C235,Tabela7[],3,0))","v":""},{"$f":"IF(C235=\"\",\"\",VLOOKUP(C235,Tabela7[],4,0))","v":""},{"$f":"IF(C235=\"\",\"\",VLOOKUP(C235,Tabela7[],5,0))","v":""}]
[null,null,null,{"$f":"IF(C236=\"\",\"\",VLOOKUP(C236,Tabela7[],2,0))","v":""},{"$f":"IF(C236=\"\",\"\",VLOOKUP(C236,Tabela7[],3,0))","v":""},{"$f":"IF(C236=\"\",\"\",VLOOKUP(C236,Tabela7[],4,0))","v":""},{"$f":"IF(C236=\"\",\"\",VLOOKUP(C236,Tabela7[],5,0))","v":""}]
[null,null,null,{"$f":"IF(C237=\"\",\"\",VLOOKUP(C237,Tabela7[],2,0))","v":""},{"$f":"IF(C237=\"\",\"\",VLOOKUP(C237,Tabela7[],3,0))","v":""},{"$f":"IF(C237=\"\",\"\",VLOOKUP(C237,Tabela7[],4,0))","v":""},{"$f":"IF(C237=\"\",\"\",VLOOKUP(C237,Tabela7[],5,0))","v":""}]
[null,null,null,{"$f":"IF(C238=\"\",\"\",VLOOKUP(C238,Tabela7[],2,0))","v":""},{"$f":"IF(C238=\"\",\"\",VLOOKUP(C238,Tabela7[],3,0))","v":""},{"$f":"IF(C238=\"\",\"\",VLOOKUP(C238,Tabela7[],4,0))","v":""},{"$f":"IF(C238=\"\",\"\",VLOOKUP(C238,Tabela7[],5,0))","v":""}]
[null,null,null,{"$f":"IF(C239=\"\",\"\",VLOOKUP(C239,Tabela7[],2,0))","v":""},{"$f":"IF(C239=\"\",\"\",VLOOKUP(C239,Tabela7[],3,0))","v":""},{"$f":"IF(C239=\"\",\"\",VLOOKUP(C239,Tabela7[],4,0))","v":""},{"$f":"IF(C239=\"\",\"\",VLOOKUP(C239,Tabela7[],5,0))","v":""}]
[null,null,null,{"$f":"IF(C240=\"\",\"\",VLOOKUP(C240,Tabela7[],2,0))","v":""},{"$f":"IF(C240=\"\",\"\",VLOOKUP(C240,Tabela7[],3,0))","v":""},{"$f":"IF(C240=\"\",\"\",VLOOKUP(C240,Tabela7[],4,0))","v":""},{"$f":"IF(C240=\"\",\"\",VLOOKUP(C240,Tabela7[],5,0))","v":""}]
[null,null,null,{"$f":"IF(C241=\"\",\"\",VLOOKUP(C241,Tabela7[],2,0))","v":""},{"$f":"IF(C241=\"\",\"\",VLOOKUP(C241,Tabela7[],3,0))","v":""},{"$f":"IF(C241=\"\",\"\",VLOOKUP(C241,Tabela7[],4,0))","v":""},{"$f":"IF(C241=\"\",\"\",VLOOKUP(C241,Tabela7[],5,0))","v":""}]
[null,null,null,{"$f":"IF(C242=\"\",\"\",VLOOKUP(C242,Tabela7[],2,0))","v":""},{"$f":"IF(C242=\"\",\"\",VLOOKUP(C242,Tabela7[],3,0))","v":""},{"$f":"IF(C242=\"\",\"\",VLOOKUP(C242,Tabela7[],4,0))","v":""},{"$f":"IF(C242=\"\",\"\",VLOOKUP(C242,Tabela7[],5,0))","v":""}]
[null,null,null,{"$f":"IF(C243=\"\",\"\",VLOOKUP(C243,Tabela7[],2,0))","v":""},{"$f":"IF(C243=\"\",\"\",VLOOKUP(C243,Tabela7[],3,0))","v":""},{"$f":"IF(C243=\"\",\"\",VLOOKUP(C243,Tabela7[],4,0))","v":""},{"$f":"IF(C243=\"\",\"\",VLOOKUP(C243,Tabela7[],5,0))","v":""}]
[null,null,null,{"$f":"IF(C244=\"\",\"\",VLOOKUP(C244,Tabela7[],2,0))","v":""},{"$f":"IF(C244=\"\",\"\",VLOOKUP(C244,Tabela7[],3,0))","v":""},{"$f":"IF(C244=\"\",\"\",VLOOKUP(C244,Tabela7[],4,0))","v":""},{"$f":"IF(C244=\"\",\"\",VLOOKUP(C244,Tabela7[],5,0))","v":""}]
[null,null,null,{"$f":"IF(C245=\"\",\"\",VLOOKUP(C245,Tabela7[],2,0))","v":""},{"$f":"IF(C245=\"\",\"\",VLOOKUP(C245,Tabela7[],3,0))","v":""},{"$f":"IF(C245=\"\",\"\",VLOOKUP(C245,Tabela7[],4,0))","v":""},{"$f":"IF(C245=\"\",\"\",VLOOKUP(C245,Tabela7[],5,0))","v":""}]
[null,null,"TOTAL",null,{"$f":"MAX(E231:E245)","v":0},{"$f":"MAX(F231:F245)","v":0},0]
[null,null,"Cor"]
[]
[null,null,"S13"]
[null,null,"Código de perigo","Advertência de perigo","S","H","E","Triângulo SHE (TSHE)",null,"Espetro de perigos potenciais (EPP)"]
[null,null,null,{"$f":"IF(C251=\"\",\"\",VLOOKUP(C251,Tabela7[],2,0))","v":""},{"$f":"IF(C251=\"\",\"\",VLOOKUP(C251,Tabela7[],3,0))","v":""},{"$f":"IF(C251=\"\",\"\",VLOOKUP(C251,Tabela7[],4,0))","v":""},{"$f":"IF(C251=\"\",\"\",VLOOKUP(C251,Tabela7[],5,0))","v":""}]
[null,null,null,{"$f":"IF(C252=\"\",\"\",VLOOKUP(C252,Tabela7[],2,0))","v":""},{"$f":"IF(C252=\"\",\"\",VLOOKUP(C252,Tabela7[],3,0))","v":""},{"$f":"IF(C252=\"\",\"\",VLOOKUP(C252,Tabela7[],4,0))","v":""},{"$f":"IF(C252=\"\",\"\",VLOOKUP(C252,Tabela7[],5,0))","v":""}]
[null,null,null,{"$f":"IF(C253=\"\",\"\",VLOOKUP(C253,Tabela7[],2,0))","v":""},{"$f":"IF(C253=\"\",\"\",VLOOKUP(C253,Tabela7[],3,0))","v":""},{"$f":"IF(C253=\"\",\"\",VLOOKUP(C253,Tabela7[],4,0))","v":""},{"$f":"IF(C253=\"\",\"\",VLOOKUP(C253,Tabela7[],5,0))","v":""}]
[null,null,null,{"$f":"IF(C254=\"\",\"\",VLOOKUP(C254,Tabela7[],2,0))","v":""},{"$f":"IF(C254=\"\",\"\",VLOOKUP(C254,Tabela7[],3,0))","v":""},{"$f":"IF(C254=\"\",\"\",VLOOKUP(C254,Tabela7[],4,0))","v":""},{"$f":"IF(C254=\"\",\"\",VLOOKUP(C254,Tabela7[],5,0))","v":""}]
[null,null,null,{"$f":"IF(C255=\"\",\"\",VLOOKUP(C255,Tabela7[],2,0))","v":""},{"$f":"IF(C255=\"\",\"\",VLOOKUP(C255,Tabela7[],3,0))","v":""},{"$f":"IF(C255=\"\",\"\",VLOOKUP(C255,Tabela7[],4,0))","v":""},{"$f":"IF(C255=\"\",\"\",VLOOKUP(C255,Tabela7[],5,0))","v":""}]
[null,null,null,{"$f":"IF(C256=\"\",\"\",VLOOKUP(C256,Tabela7[],2,0))","v":""},{"$f":"IF(C256=\"\",\"\",VLOOKUP(C256,Tabela7[],3,0))","v":""},{"$f":"IF(C256=\"\",\"\",VLOOKUP(C256,Tabela7[],4,0))","v":""},{"$f":"IF(C256=\"\",\"\",VLOOKUP(C256,Tabela7[],5,0))","v":""}]
[null,null,null,{"$f":"IF(C257=\"\",\"\",VLOOKUP(C257,Tabela7[],2,0))","v":""},{"$f":"IF(C257=\"\",\"\",VLOOKUP(C257,Tabela7[],3,0))","v":""},{"$f":"IF(C257=\"\",\"\",VLOOKUP(C257,Tabela7[],4,0))","v":""},{"$f":"IF(C257=\"\",\"\",VLOOKUP(C257,Tabela7[],5,0))","v":""}]
[null,null,null,{"$f":"IF(C258=\"\",\"\",VLOOKUP(C258,Tabela7[],2,0))","v":""},{"$f":"IF(C258=\"\",\"\",VLOOKUP(C258,Tabela7[],3,0))","v":""},{"$f":"IF(C258=\"\",\"\",VLOOKUP(C258,Tabela7[],4,0))","v":""},{"$f":"IF(C258=\"\",\"\",VLOOKUP(C258,Tabela7[],5,0))","v":""}]
[null,null,null,{"$f":"IF(C259=\"\",\"\",VLOOKUP(C259,Tabela7[],2,0))","v":""},{"$f":"IF(C259=\"\",\"\",VLOOKUP(C259,Tabela7[],3,0))","v":""},{"$f":"IF(C259=\"\",\"\",VLOOKUP(C259,Tabela7[],4,0))","v":""},{"$f":"IF(C259=\"\",\"\",VLOOKUP(C259,Tabela7[],5,0))","v":""}]
[null,null,null,{"$f":"IF(C260=\"\",\"\",VLOOKUP(C260,Tabela7[],2,0))","v":""},{"$f":"IF(C260=\"\",\"\",VLOOKUP(C260,Tabela7[],3,0))","v":""},{"$f":"IF(C260=\"\",\"\",VLOOKUP(C260,Tabela7[],4,0))","v":""},{"$f":"IF(C260=\"\",\"\",VLOOKUP(C260,Tabela7[],5,0))","v":""}]
[null,null,null,{"$f":"IF(C261=\"\",\"\",VLOOKUP(C261,Tabela7[],2,0))","v":""},{"$f":"IF(C261=\"\",\"\",VLOOKUP(C261,Tabela7[],3,0))","v":""},{"$f":"IF(C261=\"\",\"\",VLOOKUP(C261,Tabela7[],4,0))","v":""},{"$f":"IF(C261=\"\",\"\",VLOOKUP(C261,Tabela7[],5,0))","v":""}]
[null,null,null,{"$f":"IF(C262=\"\",\"\",VLOOKUP(C262,Tabela7[],2,0))","v":""},{"$f":"IF(C262=\"\",\"\",VLOOKUP(C262,Tabela7[],3,0))","v":""},{"$f":"IF(C262=\"\",\"\",VLOOKUP(C262,Tabela7[],4,0))","v":""},{"$f":"IF(C262=\"\",\"\",VLOOKUP(C262,Tabela7[],5,0))","v":""}]
[null,null,null,{"$f":"IF(C263=\"\",\"\",VLOOKUP(C263,Tabela7[],2,0))","v":""},{"$f":"IF(C263=\"\",\"\",VLOOKUP(C263,Tabela7[],3,0))","v":""},{"$f":"IF(C263=\"\",\"\",VLOOKUP(C263,Tabela7[],4,0))","v":""},{"$f":"IF(C263=\"\",\"\",VLOOKUP(C263,Tabela7[],5,0))","v":""}]
[null,null,null,{"$f":"IF(C264=\"\",\"\",VLOOKUP(C264,Tabela7[],2,0))","v":""},{"$f":"IF(C264=\"\",\"\",VLOOKUP(C264,Tabela7[],3,0))","v":""},{"$f":"IF(C264=\"\",\"\",VLOOKUP(C264,Tabela7[],4,0))","v":""},{"$f":"IF(C264=\"\",\"\",VLOOKUP(C264,Tabela7[],5,0))","v":""}]
[null,null,null,{"$f":"IF(C265=\"\",\"\",VLOOKUP(C265,Tabela7[],2,0))","v":""},{"$f":"IF(C265=\"\",\"\",VLOOKUP(C265,Tabela7[],3,0))","v":""},{"$f":"IF(C265=\"\",\"\",VLOOKUP(C265,Tabela7[],4,0))","v":""},{"$f":"IF(C265=\"\",\"\",VLOOKUP(C265,Tabela7[],5,0))","v":""}]
[null,null,"TOTAL",null,{"$f":"MAX(E251:E265)","v":0},{"$f":"MAX(F251:F265)","v":0},0]
[null,null,"Cor"]
[]
[null,null,"S14"]
[null,null,"Código de perigo","Advertência de perigo","S","H","E","Triângulo SHE (TSHE)",null,"Espetro de perigos potenciais (EPP)"]
[null,null,null,{"$f":"IF(C271=\"\",\"\",VLOOKUP(C271,Tabela7[],2,0))","v":""},{"$f":"IF(C271=\"\",\"\",VLOOKUP(C271,Tabela7[],3,0))","v":""},{"$f":"IF(C271=\"\",\"\",VLOOKUP(C271,Tabela7[],4,0))","v":""},{"$f":"IF(C271=\"\",\"\",VLOOKUP(C271,Tabela7[],5,0))","v":""}]
[null,null,null,{"$f":"IF(C272=\"\",\"\",VLOOKUP(C272,Tabela7[],2,0))","v":""},{"$f":"IF(C272=\"\",\"\",VLOOKUP(C272,Tabela7[],3,0))","v":""},{"$f":"IF(C272=\"\",\"\",VLOOKUP(C272,Tabela7[],4,0))","v":""},{"$f":"IF(C272=\"\",\"\",VLOOKUP(C272,Tabela7[],5,0))","v":""}]
[null,null,null,{"$f":"IF(C273=\"\",\"\",VLOOKUP(C273,Tabela7[],2,0))","v":""},{"$f":"IF(C273=\"\",\"\",VLOOKUP(C273,Tabela7[],3,0))","v":""},{"$f":"IF(C273=\"\",\"\",VLOOKUP(C273,Tabela7[],4,0))","v":""},{"$f":"IF(C273=\"\",\"\",VLOOKUP(C273,Tabela7[],5,0))","v":""}]
[null,null,null,{"$f":"IF(C274=\"\",\"\",VLOOKUP(C274,Tabela7[],2,0))","v":""},{"$f":"IF(C274=\"\",\"\",VLOOKUP(C274,Tabela7[],3,0))","v":""},{"$f":"IF(C274=\"\",\"\",VLOOKUP(C274,Tabela7[],4,0))","v":""},{"$f":"IF(C274=\"\",\"\",VLOOKUP(C274,Tabela7[],5,0))","v":""}]
[null,null,null,{"$f":"IF(C275=\"\",\"\",VLOOKUP(C275,Tabela7[],2,0))","v":""},{"$f":"IF(C275=\"\",\"\",VLOOKUP(C275,Tabela7[],3,0))","v":""},{"$f":"IF(C275=\"\",\"\",VLOOKUP(C275,Tabela7[],4,0))","v":""},{"$f":"IF(C275=\"\",\"\",VLOOKUP(C275,Tabela7[],5,0))","v":""}]
[null,null,null,{"$f":"IF(C276=\"\",\"\",VLOOKUP(C276,Tabela7[],2,0))","v":""},{"$f":"IF(C276=\"\",\"\",VLOOKUP(C276,Tabela7[],3,0))","v":""},{"$f":"IF(C276=\"\",\"\",VLOOKUP(C276,Tabela7[],4,0))","v":""},{"$f":"IF(C276=\"\",\"\",VLOOKUP(C276,Tabela7[],5,0))","v":""}]
[null,null,null,{"$f":"IF(C277=\"\",\"\",VLOOKUP(C277,Tabela7[],2,0))","v":""},{"$f":"IF(C277=\"\",\"\",VLOOKUP(C277,Tabela7[],3,0))","v":""},{"$f":"IF(C277=\"\",\"\",VLOOKUP(C277,Tabela7[],4,0))","v":""},{"$f":"IF(C277=\"\",\"\",VLOOKUP(C277,Tabela7[],5,0))","v":""}]
[null,null,null,{"$f":"IF(C278=\"\",\"\",VLOOKUP(C278,Tabela7[],2,0))","v":""},{"$f":"IF(C278=\"\",\"\",VLOOKUP(C278,Tabela7[],3,0))","v":""},{"$f":"IF(C278=\"\",\"\",VLOOKUP(C278,Tabela7[],4,0))","v":""},{"$f":"IF(C278=\"\",\"\",VLOOKUP(C278,Tabela7[],5,0))","v":""}]
[null,null,null,{"$f":"IF(C279=\"\",\"\",VLOOKUP(C279,Tabela7[],2,0))","v":""},{"$f":"IF(C279=\"\",\"\",VLOOKUP(C279,Tabela7[],3,0))","v":""},{"$f":"IF(C279=\"\",\"\",VLOOKUP(C279,Tabela7[],4,0))","v":""},{"$f":"IF(C279=\"\",\"\",VLOOKUP(C279,Tabela7[],5,0))","v":""}]
[null,null,null,{"$f":"IF(C280=\"\",\"\",VLOOKUP(C280,Tabela7[],2,0))","v":""},{"$f":"IF(C280=\"\",\"\",VLOOKUP(C280,Tabela7[],3,0))","v":""},{"$f":"IF(C280=\"\",\"\",VLOOKUP(C280,Tabela7[],4,0))","v":""},{"$f":"IF(C280=\"\",\"\",VLOOKUP(C280,Tabela7[],5,0))","v":""}]
[null,null,null,{"$f":"IF(C281=\"\",\"\",VLOOKUP(C281,Tabela7[],2,0))","v":""},{"$f":"IF(C281=\"\",\"\",VLOOKUP(C281,Tabela7[],3,0))","v":""},{"$f":"IF(C281=\"\",\"\",VLOOKUP(C281,Tabela7[],4,0))","v":""},{"$f":"IF(C281=\"\",\"\",VLOOKUP(C281,Tabela7[],5,0))","v":""}]
[null,null,null,{"$f":"IF(C282=\"\",\"\",VLOOKUP(C282,Tabela7[],2,0))","v":""},{"$f":"IF(C282=\"\",\"\",VLOOKUP(C282,Tabela7[],3,0))","v":""},{"$f":"IF(C282=\"\",\"\",VLOOKUP(C282,Tabela7[],4,0))","v":""},{"$f":"IF(C282=\"\",\"\",VLOOKUP(C282,Tabela7[],5,0))","v":""}]
[null,null,null,{"$f":"IF(C283=\"\",\"\",VLOOKUP(C283,Tabela7[],2,0))","v":""},{"$f":"IF(C283=\"\",\"\",VLOOKUP(C283,Tabela7[],3,0))","v":""},{"$f":"IF(C283=\"\",\"\",VLOOKUP(C283,Tabela7[],4,0))","v":""},{"$f":"IF(C283=\"\",\"\",VLOOKUP(C283,Tabela7[],5,0))","v":""}]
[null,null,null,{"$f":"IF(C284=\"\",\"\",VLOOKUP(C284,Tabela7[],2,0))","v":""},{"$f":"IF(C284=\"\",\"\",VLOOKUP(C284,Tabela7[],3,0))","v":""},{"$f":"IF(C284=\"\",\"\",VLOOKUP(C284,Tabela7[],4,0))","v":""},{"$f":"IF(C284=\"\",\"\",VLOOKUP(C284,Tabela7[],5,0))","v":""}]
[null,null,null,{"$f":"IF(C285=\"\",\"\",VLOOKUP(C285,Tabela7[],2,0))","v":""},{"$f":"IF(C285=\"\",\"\",VLOOKUP(C285,Tabela7[],3,0))","v":""},{"$f":"IF(C285=\"\",\"\",VLOOKUP(C285,Tabela7[],4,0))","v":""},{"$f":"IF(C285=\"\",\"\",VLOOKUP(C285,Tabela7[],5,0))","v":""}]
[null,null,"TOTAL",null,{"$f":"MAX(E271:E285)","v":0},{"$f":"MAX(F271:F285)","v":0},0]
[null,null,"Cor"]
[]
[null,null,"S15"]
[null,null,"Código de perigo","Advertência de perigo","S","H","E","Triângulo SHE (TSHE)",null,"Espetro de perigos potenciais (EPP)"]
[null,null,null,{"$f":"IF(C291=\"\",\"\",VLOOKUP(C291,Tabela7[],2,0))","v":""},{"$f":"IF(C291=\"\",\"\",VLOOKUP(C291,Tabela7[],3,0))","v":""},{"$f":"IF(C291=\"\",\"\",VLOOKUP(C291,Tabela7[],4,0))","v":""},{"$f":"IF(C291=\"\",\"\",VLOOKUP(C291,Tabela7[],5,0))","v":""}]
[null,null,null,{"$f":"IF(C292=\"\",\"\",VLOOKUP(C292,Tabela7[],2,0))","v":""},{"$f":"IF(C292=\"\",\"\",VLOOKUP(C292,Tabela7[],3,0))","v":""},{"$f":"IF(C292=\"\",\"\",VLOOKUP(C292,Tabela7[],4,0))","v":""},{"$f":"IF(C292=\"\",\"\",VLOOKUP(C292,Tabela7[],5,0))","v":""}]
[null,null,null,{"$f":"IF(C293=\"\",\"\",VLOOKUP(C293,Tabela7[],2,0))","v":""},{"$f":"IF(C293=\"\",\"\",VLOOKUP(C293,Tabela7[],3,0))","v":""},{"$f":"IF(C293=\"\",\"\",VLOOKUP(C293,Tabela7[],4,0))","v":""},{"$f":"IF(C293=\"\",\"\",VLOOKUP(C293,Tabela7[],5,0))","v":""}]
[null,null,null,{"$f":"IF(C294=\"\",\"\",VLOOKUP(C294,Tabela7[],2,0))","v":""},{"$f":"IF(C294=\"\",\"\",VLOOKUP(C294,Tabela7[],3,0))","v":""},{"$f":"IF(C294=\"\",\"\",VLOOKUP(C294,Tabela7[],4,0))","v":""},{"$f":"IF(C294=\"\",\"\",VLOOKUP(C294,Tabela7[],5,0))","v":""}]
[null,null,null,{"$f":"IF(C295=\"\",\"\",VLOOKUP(C295,Tabela7[],2,0))","v":""},{"$f":"IF(C295=\"\",\"\",VLOOKUP(C295,Tabela7[],3,0))","v":""},{"$f":"IF(C295=\"\",\"\",VLOOKUP(C295,Tabela7[],4,0))","v":""},{"$f":"IF(C295=\"\",\"\",VLOOKUP(C295,Tabela7[],5,0))","v":""}]
[null,null,null,{"$f":"IF(C296=\"\",\"\",VLOOKUP(C296,Tabela7[],2,0))","v":""},{"$f":"IF(C296=\"\",\"\",VLOOKUP(C296,Tabela7[],3,0))","v":""},{"$f":"IF(C296=\"\",\"\",VLOOKUP(C296,Tabela7[],4,0))","v":""},{"$f":"IF(C296=\"\",\"\",VLOOKUP(C296,Tabela7[],5,0))","v":""}]
[null,null,null,{"$f":"IF(C297=\"\",\"\",VLOOKUP(C297,Tabela7[],2,0))","v":""},{"$f":"IF(C297=\"\",\"\",VLOOKUP(C297,Tabela7[],3,0))","v":""},{"$f":"IF(C297=\"\",\"\",VLOOKUP(C297,Tabela7[],4,0))","v":""},{"$f":"IF(C297=\"\",\"\",VLOOKUP(C297,Tabela7[],5,0))","v":""}]
[null,null,null,{"$f":"IF(C298=\"\",\"\",VLOOKUP(C298,Tabela7[],2,0))","v":""},{"$f":"IF(C298=\"\",\"\",VLOOKUP(C298,Tabela7[],3,0))","v":""},{"$f":"IF(C298=\"\",\"\",VLOOKUP(C298,Tabela7[],4,0))","v":""},{"$f":"IF(C298=\"\",\"\",VLOOKUP(C298,Tabela7[],5,0))","v":""}]
[null,null,null,{"$f":"IF(C299=\"\",\"\",VLOOKUP(C299,Tabela7[],2,0))","v":""},{"$f":"IF(C299=\"\",\"\",VLOOKUP(C299,Tabela7[],3,0))","v":""},{"$f":"IF(C299=\"\",\"\",VLOOKUP(C299,Tabela7[],4,0))","v":""},{"$f":"IF(C299=\"\",\"\",VLOOKUP(C299,Tabela7[],5,0))","v":""}]
[null,null,null,{"$f":"IF(C300=\"\",\"\",VLOOKUP(C300,Tabela7[],2,0))","v":""},{"$f":"IF(C300=\"\",\"\",VLOOKUP(C300,Tabela7[],3,0))","v":""},{"$f":"IF(C300=\"\",\"\",VLOOKUP(C300,Tabela7[],4,0))","v":""},{"$f":"IF(C300=\"\",\"\",VLOOKUP(C300,Tabela7[],5,0))","v":""}]
[null,null,null,{"$f":"IF(C301=\"\",\"\",VLOOKUP(C301,Tabela7[],2,0))","v":""},{"$f":"IF(C301=\"\",\"\",VLOOKUP(C301,Tabela7[],3,0))","v":""},{"$f":"IF(C301=\"\",\"\",VLOOKUP(C301,Tabela7[],4,0))","v":""},{"$f":"IF(C301=\"\",\"\",VLOOKUP(C301,Tabela7[],5,0))","v":""}]
[null,null,null,{"$f":"IF(C302=\"\",\"\",VLOOKUP(C302,Tabela7[],2,0))","v":""},{"$f":"IF(C302=\"\",\"\",VLOOKUP(C302,Tabela7[],3,0))","v":""},{"$f":"IF(C302=\"\",\"\",VLOOKUP(C302,Tabela7[],4,0))","v":""},{"$f":"IF(C302=\"\",\"\",VLOOKUP(C302,Tabela7[],5,0))","v":""}]
[null,null,null,{"$f":"IF(C303=\"\",\"\",VLOOKUP(C303,Tabela7[],2,0))","v":""},{"$f":"IF(C303=\"\",\"\",VLOOKUP(C303,Tabela7[],3,0))","v":""},{"$f":"IF(C303=\"\",\"\",VLOOKUP(C303,Tabela7[],4,0))","v":""},{"$f":"IF(C303=\"\",\"\",VLOOKUP(C303,Tabela7[],5,0))","v":""}]
[null,null,null,{"$f":"IF(C304=\"\",\"\",VLOOKUP(C304,Tabela7[],2,0))","v":""},{"$f":"IF(C304=\"\",\"\",VLOOKUP(C304,Tabela7[],3,0))","v":""},{"$f":"IF(C304=\"\",\"\",VLOOKUP(C304,Tabela7[],4,0))","v":""},{"$f":"IF(C304=\"\",\"\",VLOOKUP(C304,Tabela7[],5,0))","v":""}]
[null,null,null,{"$f":"IF(C305=\"\",\"\",VLOOKUP(C305,Tabela7[],2,0))","v":""},{"$f":"IF(C305=\"\",\"\",VLOOKUP(C305,Tabela7[],3,0))","v":""},{"$f":"IF(C305=\"\",\"\",VLOOKUP(C305,Tabela7[],4,0))","v":""},{"$f":"IF(C305=\"\",\"\",VLOOKUP(C305,Tabela7[],5,0))","v":""}]
[null,null,"TOTAL",null,{"$f":"MAX(E291:E305)","v":0},{"$f":"MAX(F291:F305)","v":0},0]
[null,null,"Cor"]
[]
[null,null,"S16"]
[null,null,"Código de perigo","Advertência de perigo","S","H","E","Triângulo SHE (TSHE)",null,"Espetro de perigos potenciais (EPP)"]
[null,null,null,{"$f":"IF(C311=\"\",\"\",VLOOKUP(C311,Tabela7[],2,0))","v":""},{"$f":"IF(C311=\"\",\"\",VLOOKUP(C311,Tabela7[],3,0))","v":""},{"$f":"IF(C311=\"\",\"\",VLOOKUP(C311,Tabela7[],4,0))","v":""},{"$f":"IF(C311=\"\",\"\",VLOOKUP(C311,Tabela7[],5,0))","v":""}]
[null,null,null,{"$f":"IF(C312=\"\",\"\",VLOOKUP(C312,Tabela7[],2,0))","v":""},{"$f":"IF(C312=\"\",\"\",VLOOKUP(C312,Tabela7[],3,0))","v":""},{"$f":"IF(C312=\"\",\"\",VLOOKUP(C312,Tabela7[],4,0))","v":""},{"$f":"IF(C312=\"\",\"\",VLOOKUP(C312,Tabela7[],5,0))","v":""}]
[null,null,null,{"$f":"IF(C313=\"\",\"\",VLOOKUP(C313,Tabela7[],2,0))","v":""},{"$f":"IF(C313=\"\",\"\",VLOOKUP(C313,Tabela7[],3,0))","v":""},{"$f":"IF(C313=\"\",\"\",VLOOKUP(C313,Tabela7[],4,0))","v":""},{"$f":"IF(C313=\"\",\"\",VLOOKUP(C313,Tabela7[],5,0))","v":""}]
[null,null,null,{"$f":"IF(C314=\"\",\"\",VLOOKUP(C314,Tabela7[],2,0))","v":""},{"$f":"IF(C314=\"\",\"\",VLOOKUP(C314,Tabela7[],3,0))","v":""},{"$f":"IF(C314=\"\",\"\",VLOOKUP(C314,Tabela7[],4,0))","v":""},{"$f":"IF(C314=\"\",\"\",VLOOKUP(C314,Tabela7[],5,0))","v":""}]
[null,null,null,{"$f":"IF(C315=\"\",\"\",VLOOKUP(C315,Tabela7[],2,0))","v":""},{"$f":"IF(C315=\"\",\"\",VLOOKUP(C315,Tabela7[],3,0))","v":""},{"$f":"IF(C315=\"\",\"\",VLOOKUP(C315,Tabela7[],4,0))","v":""},{"$f":"IF(C315=\"\",\"\",VLOOKUP(C315,Tabela7[],5,0))","v":""}]
[null,null,null,{"$f":"IF(C316=\"\",\"\",VLOOKUP(C316,Tabela7[],2,0))","v":""},{"$f":"IF(C316=\"\",\"\",VLOOKUP(C316,Tabela7[],3,0))","v":""},{"$f":"IF(C316=\"\",\"\",VLOOKUP(C316,Tabela7[],4,0))","v":""},{"$f":"IF(C316=\"\",\"\",VLOOKUP(C316,Tabela7[],5,0))","v":""}]
[null,null,null,{"$f":"IF(C317=\"\",\"\",VLOOKUP(C317,Tabela7[],2,0))","v":""},{"$f":"IF(C317=\"\",\"\",VLOOKUP(C317,Tabela7[],3,0))","v":""},{"$f":"IF(C317=\"\",\"\",VLOOKUP(C317,Tabela7[],4,0))","v":""},{"$f":"IF(C317=\"\",\"\",VLOOKUP(C317,Tabela7[],5,0))","v":""}]
[null,null,null,{"$f":"IF(C318=\"\",\"\",VLOOKUP(C318,Tabela7[],2,0))","v":""},{"$f":"IF(C318=\"\",\"\",VLOOKUP(C318,Tabela7[],3,0))","v":""},{"$f":"IF(C318=\"\",\"\",VLOOKUP(C318,Tabela7[],4,0))","v":""},{"$f":"IF(C318=\"\",\"\",VLOOKUP(C318,Tabela7[],5,0))","v":""}]
[null,null,null,{"$f":"IF(C319=\"\",\"\",VLOOKUP(C319,Tabela7[],2,0))","v":""},{"$f":"IF(C319=\"\",\"\",VLOOKUP(C319,Tabela7[],3,0))","v":""},{"$f":"IF(C319=\"\",\"\",VLOOKUP(C319,Tabela7[],4,0))","v":""},{"$f":"IF(C319=\"\",\"\",VLOOKUP(C319,Tabela7[],5,0))","v":""}]
[null,null,null,{"$f":"IF(C320=\"\",\"\",VLOOKUP(C320,Tabela7[],2,0))","v":""},{"$f":"IF(C320=\"\",\"\",VLOOKUP(C320,Tabela7[],3,0))","v":""},{"$f":"IF(C320=\"\",\"\",VLOOKUP(C320,Tabela7[],4,0))","v":""},{"$f":"IF(C320=\"\",\"\",VLOOKUP(C320,Tabela7[],5,0))","v":""}]
[null,null,null,{"$f":"IF(C321=\"\",\"\",VLOOKUP(C321,Tabela7[],2,0))","v":""},{"$f":"IF(C321=\"\",\"\",VLOOKUP(C321,Tabela7[],3,0))","v":""},{"$f":"IF(C321=\"\",\"\",VLOOKUP(C321,Tabela7[],4,0))","v":""},{"$f":"IF(C321=\"\",\"\",VLOOKUP(C321,Tabela7[],5,0))","v":""}]
[null,null,null,{"$f":"IF(C322=\"\",\"\",VLOOKUP(C322,Tabela7[],2,0))","v":""},{"$f":"IF(C322=\"\",\"\",VLOOKUP(C322,Tabela7[],3,0))","v":""},{"$f":"IF(C322=\"\",\"\",VLOOKUP(C322,Tabela7[],4,0))","v":""},{"$f":"IF(C322=\"\",\"\",VLOOKUP(C322,Tabela7[],5,0))","v":""}]
[null,null,null,{"$f":"IF(C323=\"\",\"\",VLOOKUP(C323,Tabela7[],2,0))","v":""},{"$f":"IF(C323=\"\",\"\",VLOOKUP(C323,Tabela7[],3,0))","v":""},{"$f":"IF(C323=\"\",\"\",VLOOKUP(C323,Tabela7[],4,0))","v":""},{"$f":"IF(C323=\"\",\"\",VLOOKUP(C323,Tabela7[],5,0))","v":""}]
[null,null,null,{"$f":"IF(C324=\"\",\"\",VLOOKUP(C324,Tabela7[],2,0))","v":""},{"$f":"IF(C324=\"\",\"\",VLOOKUP(C324,Tabela7[],3,0))","v":""},{"$f":"IF(C324=\"\",\"\",VLOOKUP(C324,Tabela7[],4,0))","v":""},{"$f":"IF(C324=\"\",\"\",VLOOKUP(C324,Tabela7[],5,0))","v":""}]
[null,null,null,{"$f":"IF(C325=\"\",\"\",VLOOKUP(C325,Tabela7[],2,0))","v":""},{"$f":"IF(C325=\"\",\"\",VLOOKUP(C325,Tabela7[],3,0))","v":""},{"$f":"IF(C325=\"\",\"\",VLOOKUP(C325,Tabela7[],4,0))","v":""},{"$f":"IF(C325=\"\",\"\",VLOOKUP(C325,Tabela7[],5,0))","v":""}]
[null,null,"TOTAL",null,{"$f":"MAX(E311:E325)","v":0},{"$f":"MAX(F311:F325)","v":0},0]
[null,null,"Cor"]
[]
[null,null,"S17"]
[null,null,"Código de perigo","Advertência de perigo","S","H","E","Triângulo SHE (TSHE)",null,"Espetro de perigos potenciais (EPP)"]
[null,null,null,{"$f":"IF(C331=\"\",\"\",VLOOKUP(C331,Tabela7[],2,0))","v":""},{"$f":"IF(C331=\"\",\"\",VLOOKUP(C331,Tabela7[],3,0))","v":""},{"$f":"IF(C331=\"\",\"\",VLOOKUP(C331,Tabela7[],4,0))","v":""},{"$f":"IF(C331=\"\",\"\",VLOOKUP(C331,Tabela7[],5,0))","v":""}]
[null,null,null,{"$f":"IF(C332=\"\",\"\",VLOOKUP(C332,Tabela7[],2,0))","v":""},{"$f":"IF(C332=\"\",\"\",VLOOKUP(C332,Tabela7[],3,0))","v":""},{"$f":"IF(C332=\"\",\"\",VLOOKUP(C332,Tabela7[],4,0))","v":""},{"$f":"IF(C332=\"\",\"\",VLOOKUP(C332,Tabela7[],5,0))","v":""}]
[null,null,null,{"$f":"IF(C333=\"\",\"\",VLOOKUP(C333,Tabela7[],2,0))","v":""},{"$f":"IF(C333=\"\",\"\",VLOOKUP(C333,Tabela7[],3,0))","v":""},{"$f":"IF(C333=\"\",\"\",VLOOKUP(C333,Tabela7[],4,0))","v":""},{"$f":"IF(C333=\"\",\"\",VLOOKUP(C333,Tabela7[],5,0))","v":""}]
[null,null,null,{"$f":"IF(C334=\"\",\"\",VLOOKUP(C334,Tabela7[],2,0))","v":""},{"$f":"IF(C334=\"\",\"\",VLOOKUP(C334,Tabela7[],3,0))","v":""},{"$f":"IF(C334=\"\",\"\",VLOOKUP(C334,Tabela7[],4,0))","v":""},{"$f":"IF(C334=\"\",\"\",VLOOKUP(C334,Tabela7[],5,0))","v":""}]
[null,null,null,{"$f":"IF(C335=\"\",\"\",VLOOKUP(C335,Tabela7[],2,0))","v":""},{"$f":"IF(C335=\"\",\"\",VLOOKUP(C335,Tabela7[],3,0))","v":""},{"$f":"IF(C335=\"\",\"\",VLOOKUP(C335,Tabela7[],4,0))","v":""},{"$f":"IF(C335=\"\",\"\",VLOOKUP(C335,Tabela7[],5,0))","v":""}]
[null,null,null,{"$f":"IF(C336=\"\",\"\",VLOOKUP(C336,Tabela7[],2,0))","v":""},{"$f":"IF(C336=\"\",\"\",VLOOKUP(C336,Tabela7[],3,0))","v":""},{"$f":"IF(C336=\"\",\"\",VLOOKUP(C336,Tabela7[],4,0))","v":""},{"$f":"IF(C336=\"\",\"\",VLOOKUP(C336,Tabela7[],5,0))","v":""}]
[null,null,null,{"$f":"IF(C337=\"\",\"\",VLOOKUP(C337,Tabela7[],2,0))","v":""},{"$f":"IF(C337=\"\",\"\",VLOOKUP(C337,Tabela7[],3,0))","v":""},{"$f":"IF(C337=\"\",\"\",VLOOKUP(C337,Tabela7[],4,0))","v":""},{"$f":"IF(C337=\"\",\"\",VLOOKUP(C337,Tabela7[],5,0))","v":""}]
[null,null,null,{"$f":"IF(C338=\"\",\"\",VLOOKUP(C338,Tabela7[],2,0))","v":""},{"$f":"IF(C338=\"\",\"\",VLOOKUP(C338,Tabela7[],3,0))","v":""},{"$f":"IF(C338=\"\",\"\",VLOOKUP(C338,Tabela7[],4,0))","v":""},{"$f":"IF(C338=\"\",\"\",VLOOKUP(C338,Tabela7[],5,0))","v":""}]
[null,null,null,{"$f":"IF(C339=\"\",\"\",VLOOKUP(C339,Tabela7[],2,0))","v":""},{"$f":"IF(C339=\"\",\"\",VLOOKUP(C339,Tabela7[],3,0))","v":""},{"$f":"IF(C339=\"\",\"\",VLOOKUP(C339,Tabela7[],4,0))","v":""},{"$f":"IF(C339=\"\",\"\",VLOOKUP(C339,Tabela7[],5,0))","v":""}]
[null,null,null,{"$f":"IF(C340=\"\",\"\",VLOOKUP(C340,Tabela7[],2,0))","v":""},{"$f":"IF(C340=\"\",\"\",VLOOKUP(C340,Tabela7[],3,0))","v":""},{"$f":"IF(C340=\"\",\"\",VLOOKUP(C340,Tabela7[],4,0))","v":""},{"$f":"IF(C340=\"\",\"\",VLOOKUP(C340,Tabela7[],5,0))","v":""}]
[null,null,null,{"$f":"IF(C341=\"\",\"\",VLOOKUP(C341,Tabela7[],2,0))","v":""},{"$f":"IF(C341=\"\",\"\",VLOOKUP(C341,Tabela7[],3,0))","v":""},{"$f":"IF(C341=\"\",\"\",VLOOKUP(C341,Tabela7[],4,0))","v":""},{"$f":"IF(C341=\"\",\"\",VLOOKUP(C341,Tabela7[],5,0))","v":""}]
[null,null,null,{"$f":"IF(C342=\"\",\"\",VLOOKUP(C342,Tabela7[],2,0))","v":""},{"$f":"IF(C342=\"\",\"\",VLOOKUP(C342,Tabela7[],3,0))","v":""},{"$f":"IF(C342=\"\",\"\",VLOOKUP(C342,Tabela7[],4,0))","v":""},{"$f":"IF(C342=\"\",\"\",VLOOKUP(C342,Tabela7[],5,0))","v":""}]
[null,null,null,{"$f":"IF(C343=\"\",\"\",VLOOKUP(C343,Tabela7[],2,0))","v":""},{"$f":"IF(C343=\"\",\"\",VLOOKUP(C343,Tabela7[],3,0))","v":""},{"$f":"IF(C343=\"\",\"\",VLOOKUP(C343,Tabela7[],4,0))","v":""},{"$f":"IF(C343=\"\",\"\",VLOOKUP(C343,Tabela7[],5,0))","v":""}]
[null,null,null,{"$f":"IF(C344=\"\",\"\",VLOOKUP(C344,Tabela7[],2,0))","v":""},{"$f":"IF(C344=\"\",\"\",VLOOKUP(C344,Tabela7[],3,0))","v":""},{"$f":"IF(C344=\"\",\"\",VLOOKUP(C344,Tabela7[],4,0))","v":""},{"$f":"IF(C344=\"\",\"\",VLOOKUP(C344,Tabela7[],5,0))","v":""}]
[null,null,null,{"$f":"IF(C345=\"\",\"\",VLOOKUP(C345,Tabela7[],2,0))","v":""},{"$f":"IF(C345=\"\",\"\",VLOOKUP(C345,Tabela7[],3,0))","v":""},{"$f":"IF(C345=\"\",\"\",VLOOKUP(C345,Tabela7[],4,0))","v":""},{"$f":"IF(C345=\"\",\"\",VLOOKUP(C345,Tabela7[],5,0))","v":""}]
[null,null,"TOTAL",null,{"$f":"MAX(E331:E345)","v":0},{"$f":"MAX(F331:F345)","v":0},0]
[null,null,"Cor"]
[]
[null,null,"S18"]
[null,null,"Código de perigo","Advertência de perigo","S","H","E","Triângulo SHE (TSHE)",null,"Espetro de perigos potenciais (EPP)"]
[null,null,null,{"$f":"IF(C351=\"\",\"\",VLOOKUP(C351,Tabela7[],2,0))","v":""},{"$f":"IF(C351=\"\",\"\",VLOOKUP(C351,Tabela7[],3,0))","v":""},{"$f":"IF(C351=\"\",\"\",VLOOKUP(C351,Tabela7[],4,0))","v":""},{"$f":"IF(C351=\"\",\"\",VLOOKUP(C351,Tabela7[],5,0))","v":""}]
[null,null,null,{"$f":"IF(C352=\"\",\"\",VLOOKUP(C352,Tabela7[],2,0))","v":""},{"$f":"IF(C352=\"\",\"\",VLOOKUP(C352,Tabela7[],3,0))","v":""},{"$f":"IF(C352=\"\",\"\",VLOOKUP(C352,Tabela7[],4,0))","v":""},{"$f":"IF(C352=\"\",\"\",VLOOKUP(C352,Tabela7[],5,0))","v":""}]
[null,null,null,{"$f":"IF(C353=\"\",\"\",VLOOKUP(C353,Tabela7[],2,0))","v":""},{"$f":"IF(C353=\"\",\"\",VLOOKUP(C353,Tabela7[],3,0))","v":""},{"$f":"IF(C353=\"\",\"\",VLOOKUP(C353,Tabela7[],4,0))","v":""},{"$f":"IF(C353=\"\",\"\",VLOOKUP(C353,Tabela7[],5,0))","v":""}]
[null,null,null,{"$f":"IF(C354=\"\",\"\",VLOOKUP(C354,Tabela7[],2,0))","v":""},{"$f":"IF(C354=\"\",\"\",VLOOKUP(C354,Tabela7[],3,0))","v":""},{"$f":"IF(C354=\"\",\"\",VLOOKUP(C354,Tabela7[],4,0))","v":""},{"$f":"IF(C354=\"\",\"\",VLOOKUP(C354,Tabela7[],5,0))","v":""}]
[null,null,null,{"$f":"IF(C355=\"\",\"\",VLOOKUP(C355,Tabela7[],2,0))","v":""},{"$f":"IF(C355=\"\",\"\",VLOOKUP(C355,Tabela7[],3,0))","v":""},{"$f":"IF(C355=\"\",\"\",VLOOKUP(C355,Tabela7[],4,0))","v":""},{"$f":"IF(C355=\"\",\"\",VLOOKUP(C355,Tabela7[],5,0))","v":""}]
[null,null,null,{"$f":"IF(C356=\"\",\"\",VLOOKUP(C356,Tabela7[],2,0))","v":""},{"$f":"IF(C356=\"\",\"\",VLOOKUP(C356,Tabela7[],3,0))","v":""},{"$f":"IF(C356=\"\",\"\",VLOOKUP(C356,Tabela7[],4,0))","v":""},{"$f":"IF(C356=\"\",\"\",VLOOKUP(C356,Tabela7[],5,0))","v":""}]
[null,null,null,{"$f":"IF(C357=\"\",\"\",VLOOKUP(C357,Tabela7[],2,0))","v":""},{"$f":"IF(C357=\"\",\"\",VLOOKUP(C357,Tabela7[],3,0))","v":""},{"$f":"IF(C357=\"\",\"\",VLOOKUP(C357,Tabela7[],4,0))","v":""},{"$f":"IF(C357=\"\",\"\",VLOOKUP(C357,Tabela7[],5,0))","v":""}]
[null,null,null,{"$f":"IF(C358=\"\",\"\",VLOOKUP(C358,Tabela7[],2,0))","v":""},{"$f":"IF(C358=\"\",\"\",VLOOKUP(C358,Tabela7[],3,0))","v":""},{"$f":"IF(C358=\"\",\"\",VLOOKUP(C358,Tabela7[],4,0))","v":""},{"$f":"IF(C358=\"\",\"\",VLOOKUP(C358,Tabela7[],5,0))","v":""}]
[null,null,null,{"$f":"IF(C359=\"\",\"\",VLOOKUP(C359,Tabela7[],2,0))","v":""},{"$f":"IF(C359=\"\",\"\",VLOOKUP(C359,Tabela7[],3,0))","v":""},{"$f":"IF(C359=\"\",\"\",VLOOKUP(C359,Tabela7[],4,0))","v":""},{"$f":"IF(C359=\"\",\"\",VLOOKUP(C359,Tabela7[],5,0))","v":""}]
[null,null,null,{"$f":"IF(C360=\"\",\"\",VLOOKUP(C360,Tabela7[],2,0))","v":""},{"$f":"IF(C360=\"\",\"\",VLOOKUP(C360,Tabela7[],3,0))","v":""},{"$f":"IF(C360=\"\",\"\",VLOOKUP(C360,Tabela7[],4,0))","v":""},{"$f":"IF(C360=\"\",\"\",VLOOKUP(C360,Tabela7[],5,0))","v":""}]
[null,null,null,{"$f":"IF(C361=\"\",\"\",VLOOKUP(C361,Tabela7[],2,0))","v":""},{"$f":"IF(C361=\"\",\"\",VLOOKUP(C361,Tabela7[],3,0))","v":""},{"$f":"IF(C361=\"\",\"\",VLOOKUP(C361,Tabela7[],4,0))","v":""},{"$f":"IF(C361=\"\",\"\",VLOOKUP(C361,Tabela7[],5,0))","v":""}]
[null,null,null,{"$f":"IF(C362=\"\",\"\",VLOOKUP(C362,Tabela7[],2,0))","v":""},{"$f":"IF(C362=\"\",\"\",VLOOKUP(C362,Tabela7[],3,0))","v":""},{"$f":"IF(C362=\"\",\"\",VLOOKUP(C362,Tabela7[],4,0))","v":""},{"$f":"IF(C362=\"\",\"\",VLOOKUP(C362,Tabela7[],5,0))","v":""}]
[null,null,null,{"$f":"IF(C363=\"\",\"\",VLOOKUP(C363,Tabela7[],2,0))","v":""},{"$f":"IF(C363=\"\",\"\",VLOOKUP(C363,Tabela7[],3,0))","v":""},{"$f":"IF(C363=\"\",\"\",VLOOKUP(C363,Tabela7[],4,0))","v":""},{"$f":"IF(C363=\"\",\"\",VLOOKUP(C363,Tabela7[],5,0))","v":""}]
[null,null,null,{"$f":"IF(C364=\"\",\"\",VLOOKUP(C364,Tabela7[],2,0))","v":""},{"$f":"IF(C364=\"\",\"\",VLOOKUP(C364,Tabela7[],3,0))","v":""},{"$f":"IF(C364=\"\",\"\",VLOOKUP(C364,Tabela7[],4,0))","v":""},{"$f":"IF(C364=\"\",\"\",VLOOKUP(C364,Tabela7[],5,0))","v":""}]
[null,null,null,{"$f":"IF(C365=\"\",\"\",VLOOKUP(C365,Tabela7[],2,0))","v":""},{"$f":"IF(C365=\"\",\"\",VLOOKUP(C365,Tabela7[],3,0))","v":""},{"$f":"IF(C365=\"\",\"\",VLOOKUP(C365,Tabela7[],4,0))","v":""},{"$f":"IF(C365=\"\",\"\",VLOOKUP(C365,Tabela7[],5,0))","v":""}]
[null,null,"TOTAL",null,{"$f":"MAX(E351:E365)","v":0},{"$f":"MAX(F351:F365)","v":0},0]
[null,null,"Cor"]
[]
[null,null,"S19"]
[null,null,"Código de perigo","Advertência de perigo","S","H","E","Triângulo SHE (TSHE)",null,"Espetro de perigos potenciais (EPP)"]
[null,null,null,{"$f":"IF(C371=\"\",\"\",VLOOKUP(C371,Tabela7[],2,0))","v":""},{"$f":"IF(C371=\"\",\"\",VLOOKUP(C371,Tabela7[],3,0))","v":""},{"$f":"IF(C371=\"\",\"\",VLOOKUP(C371,Tabela7[],4,0))","v":""},{"$f":"IF(C371=\"\",\"\",VLOOKUP(C371,Tabela7[],5,0))","v":""}]
[null,null,null,{"$f":"IF(C372=\"\",\"\",VLOOKUP(C372,Tabela7[],2,0))","v":""},{"$f":"IF(C372=\"\",\"\",VLOOKUP(C372,Tabela7[],3,0))","v":""},{"$f":"IF(C372=\"\",\"\",VLOOKUP(C372,Tabela7[],4,0))","v":""},{"$f":"IF(C372=\"\",\"\",VLOOKUP(C372,Tabela7[],5,0))","v":""}]
[null,null,null,{"$f":"IF(C373=\"\",\"\",VLOOKUP(C373,Tabela7[],2,0))","v":""},{"$f":"IF(C373=\"\",\"\",VLOOKUP(C373,Tabela7[],3,0))","v":""},{"$f":"IF(C373=\"\",\"\",VLOOKUP(C373,Tabela7[],4,0))","v":""},{"$f":"IF(C373=\"\",\"\",VLOOKUP(C373,Tabela7[],5,0))","v":""}]
[null,null,null,{"$f":"IF(C374=\"\",\"\",VLOOKUP(C374,Tabela7[],2,0))","v":""},{"$f":"IF(C374=\"\",\"\",VLOOKUP(C374,Tabela7[],3,0))","v":""},{"$f":"IF(C374=\"\",\"\",VLOOKUP(C374,Tabela7[],4,0))","v":""},{"$f":"IF(C374=\"\",\"\",VLOOKUP(C374,Tabela7[],5,0))","v":""}]
[null,null,null,{"$f":"IF(C375=\"\",\"\",VLOOKUP(C375,Tabela7[],2,0))","v":""},{"$f":"IF(C375=\"\",\"\",VLOOKUP(C375,Tabela7[],3,0))","v":""},{"$f":"IF(C375=\"\",\"\",VLOOKUP(C375,Tabela7[],4,0))","v":""},{"$f":"IF(C375=\"\",\"\",VLOOKUP(C375,Tabela7[],5,0))","v":""}]
[null,null,null,{"$f":"IF(C376=\"\",\"\",VLOOKUP(C376,Tabela7[],2,0))","v":""},{"$f":"IF(C376=\"\",\"\",VLOOKUP(C376,Tabela7[],3,0))","v":""},{"$f":"IF(C376=\"\",\"\",VLOOKUP(C376,Tabela7[],4,0))","v":""},{"$f":"IF(C376=\"\",\"\",VLOOKUP(C376,Tabela7[],5,0))","v":""}]
[null,null,null,{"$f":"IF(C377=\"\",\"\",VLOOKUP(C377,Tabela7[],2,0))","v":""},{"$f":"IF(C377=\"\",\"\",VLOOKUP(C377,Tabela7[],3,0))","v":""},{"$f":"IF(C377=\"\",\"\",VLOOKUP(C377,Tabela7[],4,0))","v":""},{"$f":"IF(C377=\"\",\"\",VLOOKUP(C377,Tabela7[],5,0))","v":""}]
[null,null,null,{"$f":"IF(C378=\"\",\"\",VLOOKUP(C378,Tabela7[],2,0))","v":""},{"$f":"IF(C378=\"\",\"\",VLOOKUP(C378,Tabela7[],3,0))","v":""},{"$f":"IF(C378=\"\",\"\",VLOOKUP(C378,Tabela7[],4,0))","v":""},{"$f":"IF(C378=\"\",\"\",VLOOKUP(C378,Tabela7[],5,0))","v":""}]
[null,null,null,{"$f":"IF(C379=\"\",\"\",VLOOKUP(C379,Tabela7[],2,0))","v":""},{"$f":"IF(C379=\"\",\"\",VLOOKUP(C379,Tabela7[],3,0))","v":""},{"$f":"IF(C379=\"\",\"\",VLOOKUP(C379,Tabela7[],4,0))","v":""},{"$f":"IF(C379=\"\",\"\",VLOOKUP(C379,Tabela7[],5,0))","v":""}]
[null,null,null,{"$f":"IF(C380=\"\",\"\",VLOOKUP(C380,Tabela7[],2,0))","v":""},{"$f":"IF(C380=\"\",\"\",VLOOKUP(C380,Tabela7[],3,0))","v":""},{"$f":"IF(C380=\"\",\"\",VLOOKUP(C380,Tabela7[],4,0))","v":""},{"$f":"IF(C380=\"\",\"\",VLOOKUP(C380,Tabela7[],5,0))","v":""}]
[null,null,null,{"$f":"IF(C381=\"\",\"\",VLOOKUP(C381,Tabela7[],2,0))","v":""},{"$f":"IF(C381=\"\",\"\",VLOOKUP(C381,Tabela7[],3,0))","v":""},{"$f":"IF(C381=\"\",\"\",VLOOKUP(C381,Tabela7[],4,0))","v":""},{"$f":"IF(C381=\"\",\"\",VLOOKUP(C381,Tabela7[],5,0))","v":""}]
[null,null,null,{"$f":"IF(C382=\"\",\"\",VLOOKUP(C382,Tabela7[],2,0))","v":""},{"$f":"IF(C382=\"\",\"\",VLOOKUP(C382,Tabela7[],3,0))","v":""},{"$f":"IF(C382=\"\",\"\",VLOOKUP(C382,Tabela7[],4,0))","v":""},{"$f":"IF(C382=\"\",\"\",VLOOKUP(C382,Tabela7[],5,0))","v":""}]
[null,null,null,{"$f":"IF(C383=\"\",\"\",VLOOKUP(C383,Tabela7[],2,0))","v":""},{"$f":"IF(C383=\"\",\"\",VLOOKUP(C383,Tabela7[],3,0))","v":""},{"$f":"IF(C383=\"\",\"\",VLOOKUP(C383,Tabela7[],4,0))","v":""},{"$f":"IF(C383=\"\",\"\",VLOOKUP(C383,Tabela7[],5,0))","v":""}]
[null,null,null,{"$f":"IF(C384=\"\",\"\",VLOOKUP(C384,Tabela7[],2,0))","v":""},{"$f":"IF(C384=\"\",\"\",VLOOKUP(C384,Tabela7[],3,0))","v":""},{"$f":"IF(C384=\"\",\"\",VLOOKUP(C384,Tabela7[],4,0))","v":""},{"$f":"IF(C384=\"\",\"\",VLOOKUP(C384,Tabela7[],5,0))","v":""}]
[null,null,null,{"$f":"IF(C385=\"\",\"\",VLOOKUP(C385,Tabela7[],2,0))","v":""},{"$f":"IF(C385=\"\",\"\",VLOOKUP(C385,Tabela7[],3,0))","v":""},{"$f":"IF(C385=\"\",\"\",VLOOKUP(C385,Tabela7[],4,0))","v":""},{"$f":"IF(C385=\"\",\"\",VLOOKUP(C385,Tabela7[],5,0))","v":""}]
[null,null,"TOTAL",null,{"$f":"MAX(E371:E385)","v":0},{"$f":"MAX(F371:F385)","v":0},0]
[null,null,"Cor"]
[]
[null,null,"S20"]
[null,null,"Código de perigo","Advertência de perigo","S","H","E","Triângulo SHE (TSHE)",null,"Espetro de perigos potenciais (EPP)"]
[null,null,null,{"$f":"IF(C391=\"\",\"\",VLOOKUP(C391,Tabela7[],2,0))","v":""},{"$f":"IF(C391=\"\",\"\",VLOOKUP(C391,Tabela7[],3,0))","v":""},{"$f":"IF(C391=\"\",\"\",VLOOKUP(C391,Tabela7[],4,0))","v":""},{"$f":"IF(C391=\"\",\"\",VLOOKUP(C391,Tabela7[],5,0))","v":""}]
[null,null,null,{"$f":"IF(C392=\"\",\"\",VLOOKUP(C392,Tabela7[],2,0))","v":""},{"$f":"IF(C392=\"\",\"\",VLOOKUP(C392,Tabela7[],3,0))","v":""},{"$f":"IF(C392=\"\",\"\",VLOOKUP(C392,Tabela7[],4,0))","v":""},{"$f":"IF(C392=\"\",\"\",VLOOKUP(C392,Tabela7[],5,0))","v":""}]
[null,null,null,{"$f":"IF(C393=\"\",\"\",VLOOKUP(C393,Tabela7[],2,0))","v":""},{"$f":"IF(C393=\"\",\"\",VLOOKUP(C393,Tabela7[],3,0))","v":""},{"$f":"IF(C393=\"\",\"\",VLOOKUP(C393,Tabela7[],4,0))","v":""},{"$f":"IF(C393=\"\",\"\",VLOOKUP(C393,Tabela7[],5,0))","v":""}]
[null,null,null,{"$f":"IF(C394=\"\",\"\",VLOOKUP(C394,Tabela7[],2,0))","v":""},{"$f":"IF(C394=\"\",\"\",VLOOKUP(C394,Tabela7[],3,0))","v":""},{"$f":"IF(C394=\"\",\"\",VLOOKUP(C394,Tabela7[],4,0))","v":""},{"$f":"IF(C394=\"\",\"\",VLOOKUP(C394,Tabela7[],5,0))","v":""}]
[null,null,null,{"$f":"IF(C395=\"\",\"\",VLOOKUP(C395,Tabela7[],2,0))","v":""},{"$f":"IF(C395=\"\",\"\",VLOOKUP(C395,Tabela7[],3,0))","v":""},{"$f":"IF(C395=\"\",\"\",VLOOKUP(C395,Tabela7[],4,0))","v":""},{"$f":"IF(C395=\"\",\"\",VLOOKUP(C395,Tabela7[],5,0))","v":""}]
[null,null,null,{"$f":"IF(C396=\"\",\"\",VLOOKUP(C396,Tabela7[],2,0))","v":""},{"$f":"IF(C396=\"\",\"\",VLOOKUP(C396,Tabela7[],3,0))","v":""},{"$f":"IF(C396=\"\",\"\",VLOOKUP(C396,Tabela7[],4,0))","v":""},{"$f":"IF(C396=\"\",\"\",VLOOKUP(C396,Tabela7[],5,0))","v":""}]
[null,null,null,{"$f":"IF(C397=\"\",\"\",VLOOKUP(C397,Tabela7[],2,0))","v":""},{"$f":"IF(C397=\"\",\"\",VLOOKUP(C397,Tabela7[],3,0))","v":""},{"$f":"IF(C397=\"\",\"\",VLOOKUP(C397,Tabela7[],4,0))","v":""},{"$f":"IF(C397=\"\",\"\",VLOOKUP(C397,Tabela7[],5,0))","v":""}]
[null,null,null,{"$f":"IF(C398=\"\",\"\",VLOOKUP(C398,Tabela7[],2,0))","v":""},{"$f":"IF(C398=\"\",\"\",VLOOKUP(C398,Tabela7[],3,0))","v":""},{"$f":"IF(C398=\"\",\"\",VLOOKUP(C398,Tabela7[],4,0))","v":""},{"$f":"IF(C398=\"\",\"\",VLOOKUP(C398,Tabela7[],5,0))","v":""}]
[null,null,null,{"$f":"IF(C399=\"\",\"\",VLOOKUP(C399,Tabela7[],2,0))","v":""},{"$f":"IF(C399=\"\",\"\",VLOOKUP(C399,Tabela7[],3,0))","v":""},{"$f":"IF(C399=\"\",\"\",VLOOKUP(C399,Tabela7[],4,0))","v":""},{"$f":"IF(C399=\"\",\"\",VLOOKUP(C399,Tabela7[],5,0))","v":""}]
[null,null,null,{"$f":"IF(C400=\"\",\"\",VLOOKUP(C400,Tabela7[],2,0))","v":""},{"$f":"IF(C400=\"\",\"\",VLOOKUP(C400,Tabela7[],3,0))","v":""},{"$f":"IF(C400=\"\",\"\",VLOOKUP(C400,Tabela7[],4,0))","v":""},{"$f":"IF(C400=\"\",\"\",VLOOKUP(C400,Tabela7[],5,0))","v":""}]
[null,null,null,{"$f":"IF(C401=\"\",\"\",VLOOKUP(C401,Tabela7[],2,0))","v":""},{"$f":"IF(C401=\"\",\"\",VLOOKUP(C401,Tabela7[],3,0))","v":""},{"$f":"IF(C401=\"\",\"\",VLOOKUP(C401,Tabela7[],4,0))","v":""},{"$f":"IF(C401=\"\",\"\",VLOOKUP(C401,Tabela7[],5,0))","v":""}]
[null,null,null,{"$f":"IF(C402=\"\",\"\",VLOOKUP(C402,Tabela7[],2,0))","v":""},{"$f":"IF(C402=\"\",\"\",VLOOKUP(C402,Tabela7[],3,0))","v":""},{"$f":"IF(C402=\"\",\"\",VLOOKUP(C402,Tabela7[],4,0))","v":""},{"$f":"IF(C402=\"\",\"\",VLOOKUP(C402,Tabela7[],5,0))","v":""}]
[null,null,null,{"$f":"IF(C403=\"\",\"\",VLOOKUP(C403,Tabela7[],2,0))","v":""},{"$f":"IF(C403=\"\",\"\",VLOOKUP(C403,Tabela7[],3,0))","v":""},{"$f":"IF(C403=\"\",\"\",VLOOKUP(C403,Tabela7[],4,0))","v":""},{"$f":"IF(C403=\"\",\"\",VLOOKUP(C403,Tabela7[],5,0))","v":""}]
[null,null,null,{"$f":"IF(C404=\"\",\"\",VLOOKUP(C404,Tabela7[],2,0))","v":""},{"$f":"IF(C404=\"\",\"\",VLOOKUP(C404,Tabela7[],3,0))","v":""},{"$f":"IF(C404=\"\",\"\",VLOOKUP(C404,Tabela7[],4,0))","v":""},{"$f":"IF(C404=\"\",\"\",VLOOKUP(C404,Tabela7[],5,0))","v":""}]
[null,null,null,{"$f":"IF(C405=\"\",\"\",VLOOKUP(C405,Tabela7[],2,0))","v":""},{"$f":"IF(C405=\"\",\"\",VLOOKUP(C405,Tabela7[],3,0))","v":""},{"$f":"IF(C405=\"\",\"\",VLOOKUP(C405,Tabela7[],4,0))","v":""},{"$f":"IF(C405=\"\",\"\",VLOOKUP(C405,Tabela7[],5,0))","v":""}]
[null,null,"TOTAL",null,{"$f":"MAX(E391:E405)","v":0},{"$f":"MAX(F391:F405)","v":0},0]
[null,null,"Cor"]

{"sheet":"3_Resultados_Globais","index":2,"n_rows":302,"n_cols":22,"rows_kept":302,"cut":false,"hidden":false,"merged":[[0,4,0,7],[0,9,0,19],[0,21,0,25],[4,9,4,19]]}
[null,null,null,null,"Perigos globais da atividade",null,null,null,null,"Espetro de Perigos Potenciais (EPP) global",null,null,null,null,null,null,null,null,null,null,null,"Triângulo SHE (TSHE) global"]
[null,null,null,null,"Códigos de perigo","S","H","E"]
["H302",{"$f":"IF(A3=\"\",\"\",VLOOKUP(A3,Tabela1[],2,0))","v":51},14,null,{"$f":"IF(C3=\"\",\"\",VLOOKUP(C3,Tabela2[],2,0))","v":"H224"},{"$f":"IF(E3=\"\",\"\",VLOOKUP(E3,Tabela7[],3,0))","v":2},{"$f":"IF(E3=\"\",\"\",VLOOKUP(E3,Tabela7[],4,0))","v":0},{"$f":"IF(E3=\"\",\"\",VLOOKUP(E3,Tabela7[],5,0))","v":0}]
["H311",{"$f":"IF(A4=\"\",\"\",VLOOKUP(A4,Tabela1[],2,0))","v":56},16,null,{"$f":"IF(C4=\"\",\"\",VLOOKUP(C4,Tabela2[],2,0))","v":"H226"},{"$f":"IF(E4=\"\",\"\",VLOOKUP(E4,Tabela7[],3,0))","v":1},{"$f":"IF(E4=\"\",\"\",VLOOKUP(E4,Tabela7[],4,0))","v":0},{"$f":"IF(E4=\"\",\"\",VLOOKUP(E4,Tabela7[],5,0))","v":0}]
["H314",{"$f":"IF(A5=\"\",\"\",VLOOKUP(A5,Tabela1[],2,0))","v":59},45,null,{"$f":"IF(C5=\"\",\"\",VLOOKUP(C5,Tabela2[],2,0))","v":"EUH019"},{"$f":"IF(E5=\"\",\"\",VLOOKUP(E5,Tabela7[],3,0))","v":2},{"$f":"IF(E5=\"\",\"\",VLOOKUP(E5,Tabela7[],4,0))","v":0},{"$f":"IF(E5=\"\",\"\",VLOOKUP(E5,Tabela7[],5,0))","v":0},null,"Clicar para obter EPP global"]
["H412",{"$f":"IF(A6=\"\",\"\",VLOOKUP(A6,Tabela1[],2,0))","v":105},51,null,{"$f":"IF(C6=\"\",\"\",VLOOKUP(C6,Tabela2[],2,0))","v":"H302"},{"$f":"IF(E6=\"\",\"\",VLOOKUP(E6,Tabela7[],3,0))","v":0},{"$f":"IF(E6=\"\",\"\",VLOOKUP(E6,Tabela7[],4,0))","v":1},{"$f":"IF(E6=\"\",\"\",VLOOKUP(E6,Tabela7[],5,0))","v":0}]
[null,{"$f":"IF(A7=\"\",\"\",VLOOKUP(A7,Tabela1[],2,0))","v":""},56,null,{"$f":"IF(C7=\"\",\"\",VLOOKUP(C7,Tabela2[],2,0))","v":"H311"},{"$f":"IF(E7=\"\",\"\",VLOOKUP(E7,Tabela7[],3,0))","v":0},{"$f":"IF(E7=\"\",\"\",VLOOKUP(E7,Tabela7[],4,0))","v":2},{"$f":"IF(E7=\"\",\"\",VLOOKUP(E7,Tabela7[],5,0))","v":0}]
["H226",{"$f":"IF(A8=\"\",\"\",VLOOKUP(A8,Tabela1[],2,0))","v":16},59,null,{"$f":"IF(C8=\"\",\"\",VLOOKUP(C8,Tabela2[],2,0))","v":"H314"},{"$f":"IF(E8=\"\",\"\",VLOOKUP(E8,Tabela7[],3,0))","v":0},{"$f":"IF(E8=\"\",\"\",VLOOKUP(E8,Tabela7[],4,0))","v":2},{"$f":"IF(E8=\"\",\"\",VLOOKUP(E8,Tabela7[],5,0))","v":0}]
["H224",{"$f":"IF(A9=\"\",\"\",VLOOKUP(A9,Tabela1[],2,0))","v":14},72,null,{"$f":"IF(C9=\"\",\"\",VLOOKUP(C9,Tabela2[],2,0))","v":"H336"},{"$f":"IF(E9=\"\",\"\",VLOOKUP(E9,Tabela7[],3,0))","v":0},{"$f":"IF(E9=\"\",\"\",VLOOKUP(E9,Tabela7[],4,0))","v":1},{"$f":"IF(E9=\"\",\"\",VLOOKUP(E9,Tabela7[],5,0))","v":0}]
["EUH019",{"$f":"IF(A10=\"\",\"\",VLOOKUP(A10,Tabela1[],2,0))","v":45},88,null,{"$f":"IF(C10=\"\",\"\",VLOOKUP(C10,Tabela2[],2,0))","v":"EUH066"},{"$f":"IF(E10=\"\",\"\",VLOOKUP(E10,Tabela7[],3,0))","v":0},{"$f":"IF(E10=\"\",\"\",VLOOKUP(E10,Tabela7[],4,0))","v":1},{"$f":"IF(E10=\"\",\"\",VLOOKUP(E10,Tabela7[],5,0))","v":0}]
["H336",{"$f":"IF(A11=\"\",\"\",VLOOKUP(A11,Tabela1[],2,0))","v":72},105,null,{"$f":"IF(C11=\"\",\"\",VLOOKUP(C11,Tabela2[],2,0))","v":"H412"},{"$f":"IF(E11=\"\",\"\",VLOOKUP(E11,Tabela7[],3,0))","v":0},{"$f":"IF(E11=\"\",\"\",VLOOKUP(E11,Tabela7[],4,0))","v":0},{"$f":"IF(E11=\"\",\"\",VLOOKUP(E11,Tabela7[],5,0))","v":1}]
["EUH066",{"$f":"IF(A12=\"\",\"\",VLOOKUP(A12,Tabela1[],2,0))","v":88},""]
[null,{"$f":"IF(A13=\"\",\"\",VLOOKUP(A13,Tabela1[],2,0))","v":""},""]
[null,{"$f":"IF(A14=\"\",\"\",VLOOKUP(A14,Tabela1[],2,0))","v":""},""]
[null,{"$f":"IF(A15=\"\",\"\",VLOOKUP(A15,Tabela1[],2,0))","v":""},""]
[null,{"$f":"IF(A16=\"\",\"\",VLOOKUP(A16,Tabela1[],2,0))","v":""},""]
[null,{"$f":"IF(A17=\"\",\"\",VLOOKUP(A17,Tabela1[],2,0))","v":""},""]
[null,{"$f":"IF(A18=\"\",\"\",VLOOKUP(A18,Tabela1[],2,0))","v":""},""]
[null,{"$f":"IF(A19=\"\",\"\",VLOOKUP(A19,Tabela1[],2,0))","v":""},""]
[null,{"$f":"IF(A20=\"\",\"\",VLOOKUP(A20,Tabela1[],2,0))","v":""},""]
[null,{"$f":"IF(A21=\"\",\"\",VLOOKUP(A21,Tabela1[],2,0))","v":""},""]
[null,{"$f":"IF(A22=\"\",\"\",VLOOKUP(A22,Tabela1[],2,0))","v":""},""]
[null,{"$f":"IF(A23=\"\",\"\",VLOOKUP(A23,Tabela1[],2,0))","v":""},""]
[null,{"$f":"IF(A24=\"\",\"\",VLOOKUP(A24,Tabela1[],2,0))","v":""},""]
[null,{"$f":"IF(A25=\"\",\"\",VLOOKUP(A25,Tabela1[],2,0))","v":""},""]
[null,{"$f":"IF(A26=\"\",\"\",VLOOKUP(A26,Tabela1[],2,0))","v":""},""]
[null,{"$f":"IF(A27=\"\",\"\",VLOOKUP(A27,Tabela1[],2,0))","v":""},""]
[null,{"$f":"IF(A28=\"\",\"\",VLOOKUP(A28,Tabela1[],2,0))","v":""},""]
[null,{"$f":"IF(A29=\"\",\"\",VLOOKUP(A29,Tabela1[],2,0))","v":""},""]
[null,{"$f":"IF(A30=\"\",\"\",VLOOKUP(A30,Tabela1[],2,0))","v":""},""]
[null,{"$f":"IF(A31=\"\",\"\",VLOOKUP(A31,Tabela1[],2,0))","v":""},""]
[null,{"$f":"IF(A32=\"\",\"\",VLOOKUP(A32,Tabela1[],2,0))","v":""},""]
[null,{"$f":"IF(A33=\"\",\"\",VLOOKUP(A33,Tabela1[],2,0))","v":""},""]
[null,{"$f":"IF(A34=\"\",\"\",VLOOKUP(A34,Tabela1[],2,0))","v":""},""]
[null,{"$f":"IF(A35=\"\",\"\",VLOOKUP(A35,Tabela1[],2,0))","v":""},""]
[null,{"$f":"IF(A36=\"\",\"\",VLOOKUP(A36,Tabela1[],2,0))","v":""},""]
[null,{"$f":"IF(A37=\"\",\"\",VLOOKUP(A37,Tabela1[],2,0))","v":""},""]
[null,{"$f":"IF(A38=\"\",\"\",VLOOKUP(A38,Tabela1[],2,0))","v":""},""]
[null,{"$f":"IF(A39=\"\",\"\",VLOOKUP(A39,Tabela1[],2,0))","v":""},""]
[null,{"$f":"IF(A40=\"\",\"\",VLOOKUP(A40,Tabela1[],2,0))","v":""},""]
[null,{"$f":"IF(A41=\"\",\"\",VLOOKUP(A41,Tabela1[],2,0))","v":""},""]
[null,{"$f":"IF(A42=\"\",\"\",VLOOKUP(A42,Tabela1[],2,0))","v":""},""]
[null,{"$f":"IF(A43=\"\",\"\",VLOOKUP(A43,Tabela1[],2,0))","v":""},""]
[null,{"$f":"IF(A44=\"\",\"\",VLOOKUP(A44,Tabela1[],2,0))","v":""},""]
[null,{"$f":"IF(A45=\"\",\"\",VLOOKUP(A45,Tabela1[],2,0))","v":""},""]
[null,{"$f":"IF(A46=\"\",\"\",VLOOKUP(A46,Tabela1[],2,0))","v":""},""]
[null,{"$f":"IF(A47=\"\",\"\",VLOOKUP(A47,Tabela1[],2,0))","v":""},""]
[null,{"$f":"IF(A48=\"\",\"\",VLOOKUP(A48,Tabela1[],2,0))","v":""},""]
[null,{"$f":"IF(A49=\"\",\"\",VLOOKUP(A49,Tabela1[],2,0))","v":""},""]
[null,{"$f":"IF(A50=\"\",\"\",VLOOKUP(A50,Tabela1[],2,0))","v":""},""]
[null,{"$f":"IF(A51=\"\",\"\",VLOOKUP(A51,Tabela1[],2,0))","v":""},""]
[null,{"$f":"IF(A52=\"\",\"\",VLOOKUP(A52,Tabela1[],2,0))","v":""},""]
[null,{"$f":"IF(A53=\"\",\"\",VLOOKUP(A53,Tabela1[],2,0))","v":""},""]
[null,{"$f":"IF(A54=\"\",\"\",VLOOKUP(A54,Tabela1[],2,0))","v":""},""]
[null,{"$f":"IF(A55=\"\",\"\",VLOOKUP(A55,Tabela1[],2,0))","v":""},""]
[null,{"$f":"IF(A56=\"\",\"\",VLOOKUP(A56,Tabela1[],2,0))","v":""},""]
[null,{"$f":"IF(A57=\"\",\"\",VLOOKUP(A57,Tabela1[],2,0))","v":""},""]
[null,{"$f":"IF(A58=\"\",\"\",VLOOKUP(A58,Tabela1[],2,0))","v":""},""]
[null,{"$f":"IF(A59=\"\",\"\",VLOOKUP(A59,Tabela1[],2,0))","v":""},""]
[null,{"$f":"IF(A60=\"\",\"\",VLOOKUP(A60,Tabela1[],2,0))","v":""},""]
[null,{"$f":"IF(A61=\"\",\"\",VLOOKUP(A61,Tabela1[],2,0))","v":""},""]
[null,{"$f":"IF(A62=\"\",\"\",VLOOKUP(A62,Tabela1[],2,0))","v":""},""]
[null,{"$f":"IF(A63=\"\",\"\",VLOOKUP(A63,Tabela1[],2,0))","v":""},""]
[null,{"$f":"IF(A64=\"\",\"\",VLOOKUP(A64,Tabela1[],2,0))","v":""},""]
[null,{"$f":"IF(A65=\"\",\"\",VLOOKUP(A65,Tabela1[],2,0))","v":""},""]
[null,{"$f":"IF(A66=\"\",\"\",VLOOKUP(A66,Tabela1[],2,0))","v":""},""]
[null,{"$f":"IF(A67=\"\",\"\",VLOOKUP(A67,Tabela1[],2,0))","v":""},""]
[null,{"$f":"IF(A68=\"\",\"\",VLOOKUP(A68,Tabela1[],2,0))","v":""},""]
[null,{"$f":"IF(A69=\"\",\"\",VLOOKUP(A69,Tabela1[],2,0))","v":""},""]
[null,{"$f":"IF(A70=\"\",\"\",VLOOKUP(A70,Tabela1[],2,0))","v":""},""]
[null,{"$f":"IF(A71=\"\",\"\",VLOOKUP(A71,Tabela1[],2,0))","v":""},""]
[null,{"$f":"IF(A72=\"\",\"\",VLOOKUP(A72,Tabela1[],2,0))","v":""},""]
[null,{"$f":"IF(A73=\"\",\"\",VLOOKUP(A73,Tabela1[],2,0))","v":""},""]
[null,{"$f":"IF(A74=\"\",\"\",VLOOKUP(A74,Tabela1[],2,0))","v":""},""]
[null,{"$f":"IF(A75=\"\",\"\",VLOOKUP(A75,Tabela1[],2,0))","v":""},""]
[null,{"$f":"IF(A76=\"\",\"\",VLOOKUP(A76,Tabela1[],2,0))","v":""},""]
[null,{"$f":"IF(A77=\"\",\"\",VLOOKUP(A77,Tabela1[],2,0))","v":""},""]
[null,{"$f":"IF(A78=\"\",\"\",VLOOKUP(A78,Tabela1[],2,0))","v":""},""]
[null,{"$f":"IF(A79=\"\",\"\",VLOOKUP(A79,Tabela1[],2,0))","v":""},""]
[null,{"$f":"IF(A80=\"\",\"\",VLOOKUP(A80,Tabela1[],2,0))","v":""},""]
[null,{"$f":"IF(A81=\"\",\"\",VLOOKUP(A81,Tabela1[],2,0))","v":""},""]
[null,{"$f":"IF(A82=\"\",\"\",VLOOKUP(A82,Tabela1[],2,0))","v":""},""]
[null,{"$f":"IF(A83=\"\",\"\",VLOOKUP(A83,Tabela1[],2,0))","v":""},""]
[null,{"$f":"IF(A84=\"\",\"\",VLOOKUP(A84,Tabela1[],2,0))","v":""},""]
[null,{"$f":"IF(A85=\"\",\"\",VLOOKUP(A85,Tabela1[],2,0))","v":""},""]
[null,{"$f":"IF(A86=\"\",\"\",VLOOKUP(A86,Tabela1[],2,0))","v":""},""]
[null,{"$f":"IF(A87=\"\",\"\",VLOOKUP(A87,Tabela1[],2,0))","v":""},""]
[null,{"$f":"IF(A88=\"\",\"\",VLOOKUP(A88,Tabela1[],2,0))","v":""},""]
[null,{"$f":"IF(A89=\"\",\"\",VLOOKUP(A89,Tabela1[],2,0))","v":""},""]
[null,{"$f":"IF(A90=\"\",\"\",VLOOKUP(A90,Tabela1[],2,0))","v":""},""]
[null,{"$f":"IF(A91=\"\",\"\",VLOOKUP(A91,Tabela1[],2,0))","v":""},""]
[null,{"$f":"IF(A92=\"\",\"\",VLOOKUP(A92,Tabela1[],2,0))","v":""},""]
[null,{"$f":"IF(A93=\"\",\"\",VLOOKUP(A93,Tabela1[],2,0))","v":""},""]
[null,{"$f":"IF(A94=\"\",\"\",VLOOKUP(A94,Tabela1[],2,0))","v":""},""]
[null,{"$f":"IF(A95=\"\",\"\",VLOOKUP(A95,Tabela1[],2,0))","v":""},""]
[null,{"$f":"IF(A96=\"\",\"\",VLOOKUP(A96,Tabela1[],2,0))","v":""},""]
[null,{"$f":"IF(A97=\"\",\"\",VLOOKUP(A97,Tabela1[],2,0))","v":""},""]
[null,{"$f":"IF(A98=\"\",\"\",VLOOKUP(A98,Tabela1[],2,0))","v":""},""]
[null,{"$f":"IF(A99=\"\",\"\",VLOOKUP(A99,Tabela1[],2,0))","v":""},""]
[null,{"$f":"IF(A100=\"\",\"\",VLOOKUP(A100,Tabela1[],2,0))","v":""},""]
[null,{"$f":"IF(A101=\"\",\"\",VLOOKUP(A101,Tabela1[],2,0))","v":""},""]
[null,{"$f":"IF(A102=\"\",\"\",VLOOKUP(A102,Tabela1[],2,0))","v":""},""]
[null,{"$f":"IF(A103=\"\",\"\",VLOOKUP(A103,Tabela1[],2,0))","v":""},""]
[null,{"$f":"IF(A104=\"\",\"\",VLOOKUP(A104,Tabela1[],2,0))","v":""},""]
[null,{"$f":"IF(A105=\"\",\"\",VLOOKUP(A105,Tabela1[],2,0))","v":""},""]
[null,{"$f":"IF(A106=\"\",\"\",VLOOKUP(A106,Tabela1[],2,0))","v":""},""]
[null,{"$f":"IF(A107=\"\",\"\",VLOOKUP(A107,Tabela1[],2,0))","v":""},""]
[null,{"$f":"IF(A108=\"\",\"\",VLOOKUP(A108,Tabela1[],2,0))","v":""},""]
[null,{"$f":"IF(A109=\"\",\"\",VLOOKUP(A109,Tabela1[],2,0))","v":""},""]
[null,{"$f":"IF(A110=\"\",\"\",VLOOKUP(A110,Tabela1[],2,0))","v":""},""]
[null,{"$f":"IF(A111=\"\",\"\",VLOOKUP(A111,Tabela1[],2,0))","v":""},""]
[null,{"$f":"IF(A112=\"\",\"\",VLOOKUP(A112,Tabela1[],2,0))","v":""},""]
[null,{"$f":"IF(A113=\"\",\"\",VLOOKUP(A113,Tabela1[],2,0))","v":""},""]
[null,{"$f":"IF(A114=\"\",\"\",VLOOKUP(A114,Tabela1[],2,0))","v":""},""]
[null,{"$f":"IF(A115=\"\",\"\",VLOOKUP(A115,Tabela1[],2,0))","v":""},""]
[null,{"$f":"IF(A116=\"\",\"\",VLOOKUP(A116,Tabela1[],2,0))","v":""},""]
[null,{"$f":"IF(A117=\"\",\"\",VLOOKUP(A117,Tabela1[],2,0))","v":""},""]
[null,{"$f":"IF(A118=\"\",\"\",VLOOKUP(A118,Tabela1[],2,0))","v":""},""]
[null,{"$f":"IF(A119=\"\",\"\",VLOOKUP(A119,Tabela1[],2,0))","v":""},""]
[null,{"$f":"IF(A120=\"\",\"\",VLOOKUP(A120,Tabela1[],2,0))","v":""},""]
[null,{"$f":"IF(A121=\"\",\"\",VLOOKUP(A121,Tabela1[],2,0))","v":""},""]
[null,{"$f":"IF(A122=\"\",\"\",VLOOKUP(A122,Tabela1[],2,0))","v":""},""]
[null,{"$f":"IF(A123=\"\",\"\",VLOOKUP(A123,Tabela1[],2,0))","v":""},""]
[null,{"$f":"IF(A124=\"\",\"\",VLOOKUP(A124,Tabela1[],2,0))","v":""},""]
[null,{"$f":"IF(A125=\"\",\"\",VLOOKUP(A125,Tabela1[],2,0))","v":""},""]
[null,{"$f":"IF(A126=\"\",\"\",VLOOKUP(A126,Tabela1[],2,0))","v":""},""]
[null,{"$f":"IF(A127=\"\",\"\",VLOOKUP(A127,Tabela1[],2,0))","v":""},""]
[null,{"$f":"IF(A128=\"\",\"\",VLOOKUP(A128,Tabela1[],2,0))","v":""},""]
[null,{"$f":"IF(A129=\"\",\"\",VLOOKUP(A129,Tabela1[],2,0))","v":""},""]
[null,{"$f":"IF(A130=\"\",\"\",VLOOKUP(A130,Tabela1[],2,0))","v":""},""]
[null,{"$f":"IF(A131=\"\",\"\",VLOOKUP(A131,Tabela1[],2,0))","v":""},""]
[null,{"$f":"IF(A132=\"\",\"\",VLOOKUP(A132,Tabela1[],2,0))","v":""},""]
[null,{"$f":"IF(A133=\"\",\"\",VLOOKUP(A133,Tabela1[],2,0))","v":""},""]
[null,{"$f":"IF(A134=\"\",\"\",VLOOKUP(A134,Tabela1[],2,0))","v":""},""]
[null,{"$f":"IF(A135=\"\",\"\",VLOOKUP(A135,Tabela1[],2,0))","v":""},""]
[null,{"$f":"IF(A136=\"\",\"\",VLOOKUP(A136,Tabela1[],2,0))","v":""},""]
[null,{"$f":"IF(A137=\"\",\"\",VLOOKUP(A137,Tabela1[],2,0))","v":""},""]
[null,{"$f":"IF(A138=\"\",\"\",VLOOKUP(A138,Tabela1[],2,0))","v":""},""]
[null,{"$f":"IF(A139=\"\",\"\",VLOOKUP(A139,Tabela1[],2,0))","v":""},""]
[null,{"$f":"IF(A140=\"\",\"\",VLOOKUP(A140,Tabela1[],2,0))","v":""},""]
[null,{"$f":"IF(A141=\"\",\"\",VLOOKUP(A141,Tabela1[],2,0))","v":""},""]
[null,{"$f":"IF(A142=\"\",\"\",VLOOKUP(A142,Tabela1[],2,0))","v":""},""]
[null,{"$f":"IF(A143=\"\",\"\",VLOOKUP(A143,Tabela1[],2,0))","v":""},""]
[null,{"$f":"IF(A144=\"\",\"\",VLOOKUP(A144,Tabela1[],2,0))","v":""},""]
[null,{"$f":"IF(A145=\"\",\"\",VLOOKUP(A145,Tabela1[],2,0))","v":""},""]
[null,{"$f":"IF(A146=\"\",\"\",VLOOKUP(A146,Tabela1[],2,0))","v":""},""]
[null,{"$f":"IF(A147=\"\",\"\",VLOOKUP(A147,Tabela1[],2,0))","v":""},""]
[null,{"$f":"IF(A148=\"\",\"\",VLOOKUP(A148,Tabela1[],2,0))","v":""},""]
[null,{"$f":"IF(A149=\"\",\"\",VLOOKUP(A149,Tabela1[],2,0))","v":""},""]
[null,{"$f":"IF(A150=\"\",\"\",VLOOKUP(A150,Tabela1[],2,0))","v":""},""]
[null,{"$f":"IF(A151=\"\",\"\",VLOOKUP(A151,Tabela1[],2,0))","v":""},""]
[null,{"$f":"IF(A152=\"\",\"\",VLOOKUP(A152,Tabela1[],2,0))","v":""},""]
[null,{"$f":"IF(A153=\"\",\"\",VLOOKUP(A153,Tabela1[],2,0))","v":""},""]
[null,{"$f":"IF(A154=\"\",\"\",VLOOKUP(A154,Tabela1[],2,0))","v":""},""]
[null,{"$f":"IF(A155=\"\",\"\",VLOOKUP(A155,Tabela1[],2,0))","v":""},""]
[null,{"$f":"IF(A156=\"\",\"\",VLOOKUP(A156,Tabela1[],2,0))","v":""},""]
[null,{"$f":"IF(A157=\"\",\"\",VLOOKUP(A157,Tabela1[],2,0))","v":""},""]
[null,{"$f":"IF(A158=\"\",\"\",VLOOKUP(A158,Tabela1[],2,0))","v":""},""]
[null,{"$f":"IF(A159=\"\",\"\",VLOOKUP(A159,Tabela1[],2,0))","v":""},""]
[null,{"$f":"IF(A160=\"\",\"\",VLOOKUP(A160,Tabela1[],2,0))","v":""},""]
[null,{"$f":"IF(A161=\"\",\"\",VLOOKUP(A161,Tabela1[],2,0))","v":""},""]
[null,{"$f":"IF(A162=\"\",\"\",VLOOKUP(A162,Tabela1[],2,0))","v":""},""]
[null,{"$f":"IF(A163=\"\",\"\",VLOOKUP(A163,Tabela1[],2,0))","v":""},""]
[null,{"$f":"IF(A164=\"\",\"\",VLOOKUP(A164,Tabela1[],2,0))","v":""},""]
[null,{"$f":"IF(A165=\"\",\"\",VLOOKUP(A165,Tabela1[],2,0))","v":""},""]
[null,{"$f":"IF(A166=\"\",\"\",VLOOKUP(A166,Tabela1[],2,0))","v":""},""]
[null,{"$f":"IF(A167=\"\",\"\",VLOOKUP(A167,Tabela1[],2,0))","v":""},""]
[null,{"$f":"IF(A168=\"\",\"\",VLOOKUP(A168,Tabela1[],2,0))","v":""},""]
[null,{"$f":"IF(A169=\"\",\"\",VLOOKUP(A169,Tabela1[],2,0))","v":""},""]
[null,{"$f":"IF(A170=\"\",\"\",VLOOKUP(A170,Tabela1[],2,0))","v":""},""]
[null,{"$f":"IF(A171=\"\",\"\",VLOOKUP(A171,Tabela1[],2,0))","v":""},""]
[null,{"$f":"IF(A172=\"\",\"\",VLOOKUP(A172,Tabela1[],2,0))","v":""},""]
[null,{"$f":"IF(A173=\"\",\"\",VLOOKUP(A173,Tabela1[],2,0))","v":""},""]
[null,{"$f":"IF(A174=\"\",\"\",VLOOKUP(A174,Tabela1[],2,0))","v":""},""]
[null,{"$f":"IF(A175=\"\",\"\",VLOOKUP(A175,Tabela1[],2,0))","v":""},""]
[null,{"$f":"IF(A176=\"\",\"\",VLOOKUP(A176,Tabela1[],2,0))","v":""},""]
[null,{"$f":"IF(A177=\"\",\"\",VLOOKUP(A177,Tabela1[],2,0))","v":""},""]
[null,{"$f":"IF(A178=\"\",\"\",VLOOKUP(A178,Tabela1[],2,0))","v":""},""]
[null,{"$f":"IF(A179=\"\",\"\",VLOOKUP(A179,Tabela1[],2,0))","v":""},""]
[null,{"$f":"IF(A180=\"\",\"\",VLOOKUP(A180,Tabela1[],2,0))","v":""},""]
[null,{"$f":"IF(A181=\"\",\"\",VLOOKUP(A181,Tabela1[],2,0))","v":""},""]
[null,{"$f":"IF(A182=\"\",\"\",VLOOKUP(A182,Tabela1[],2,0))","v":""},""]
[null,{"$f":"IF(A183=\"\",\"\",VLOOKUP(A183,Tabela1[],2,0))","v":""},""]
[null,{"$f":"IF(A184=\"\",\"\",VLOOKUP(A184,Tabela1[],2,0))","v":""},""]
[null,{"$f":"IF(A185=\"\",\"\",VLOOKUP(A185,Tabela1[],2,0))","v":""},""]
[null,{"$f":"IF(A186=\"\",\"\",VLOOKUP(A186,Tabela1[],2,0))","v":""},""]
[null,{"$f":"IF(A187=\"\",\"\",VLOOKUP(A187,Tabela1[],2,0))","v":""},""]
[null,{"$f":"IF(A188=\"\",\"\",VLOOKUP(A188,Tabela1[],2,0))","v":""},""]
[null,{"$f":"IF(A189=\"\",\"\",VLOOKUP(A189,Tabela1[],2,0))","v":""},""]
[null,{"$f":"IF(A190=\"\",\"\",VLOOKUP(A190,Tabela1[],2,0))","v":""},""]
[null,{"$f":"IF(A191=\"\",\"\",VLOOKUP(A191,Tabela1[],2,0))","v":""},""]
[null,{"$f":"IF(A192=\"\",\"\",VLOOKUP(A192,Tabela1[],2,0))","v":""},""]
[null,{"$f":"IF(A193=\"\",\"\",VLOOKUP(A193,Tabela1[],2,0))","v":""},""]
[null,{"$f":"IF(A194=\"\",\"\",VLOOKUP(A194,Tabela1[],2,0))","v":""},""]
[null,{"$f":"IF(A195=\"\",\"\",VLOOKUP(A195,Tabela1[],2,0))","v":""},""]
[null,{"$f":"IF(A196=\"\",\"\",VLOOKUP(A196,Tabela1[],2,0))","v":""},""]
[null,{"$f":"IF(A197=\"\",\"\",VLOOKUP(A197,Tabela1[],2,0))","v":""},""]
[null,{"$f":"IF(A198=\"\",\"\",VLOOKUP(A198,Tabela1[],2,0))","v":""},""]
[null,{"$f":"IF(A199=\"\",\"\",VLOOKUP(A199,Tabela1[],2,0))","v":""},""]
[null,{"$f":"IF(A200=\"\",\"\",VLOOKUP(A200,Tabela1[],2,0))","v":""},""]
[null,{"$f":"IF(A201=\"\",\"\",VLOOKUP(A201,Tabela1[],2,0))","v":""},""]
[null,{"$f":"IF(A202=\"\",\"\",VLOOKUP(A202,Tabela1[],2,0))","v":""},""]
[null,{"$f":"IF(A203=\"\",\"\",VLOOKUP(A203,Tabela1[],2,0))","v":""},""]
[null,{"$f":"IF(A204=\"\",\"\",VLOOKUP(A204,Tabela1[],2,0))","v":""},""]
[null,{"$f":"IF(A205=\"\",\"\",VLOOKUP(A205,Tabela1[],2,0))","v":""},""]
[null,{"$f":"IF(A206=\"\",\"\",VLOOKUP(A206,Tabela1[],2,0))","v":""},""]
[null,{"$f":"IF(A207=\"\",\"\",VLOOKUP(A207,Tabela1[],2,0))","v":""},""]
[null,{"$f":"IF(A208=\"\",\"\",VLOOKUP(A208,Tabela1[],2,0))","v":""},""]
[null,{"$f":"IF(A209=\"\",\"\",VLOOKUP(A209,Tabela1[],2,0))","v":""},""]
[null,{"$f":"IF(A210=\"\",\"\",VLOOKUP(A210,Tabela1[],2,0))","v":""},""]
[null,{"$f":"IF(A211=\"\",\"\",VLOOKUP(A211,Tabela1[],2,0))","v":""},""]
[null,{"$f":"IF(A212=\"\",\"\",VLOOKUP(A212,Tabela1[],2,0))","v":""},""]
[null,{"$f":"IF(A213=\"\",\"\",VLOOKUP(A213,Tabela1[],2,0))","v":""},""]
[null,{"$f":"IF(A214=\"\",\"\",VLOOKUP(A214,Tabela1[],2,0))","v":""},""]
[null,{"$f":"IF(A215=\"\",\"\",VLOOKUP(A215,Tabela1[],2,0))","v":""},""]
[null,{"$f":"IF(A216=\"\",\"\",VLOOKUP(A216,Tabela1[],2,0))","v":""},""]
[null,{"$f":"IF(A217=\"\",\"\",VLOOKUP(A217,Tabela1[],2,0))","v":""},""]
[null,{"$f":"IF(A218=\"\",\"\",VLOOKUP(A218,Tabela1[],2,0))","v":""},""]
[null,{"$f":"IF(A219=\"\",\"\",VLOOKUP(A219,Tabela1[],2,0))","v":""},""]
[null,{"$f":"IF(A220=\"\",\"\",VLOOKUP(A220,Tabela1[],2,0))","v":""},""]
[null,{"$f":"IF(A221=\"\",\"\",VLOOKUP(A221,Tabela1[],2,0))","v":""},""]
[null,{"$f":"IF(A222=\"\",\"\",VLOOKUP(A222,Tabela1[],2,0))","v":""},""]
[null,{"$f":"IF(A223=\"\",\"\",VLOOKUP(A223,Tabela1[],2,0))","v":""},""]
[null,{"$f":"IF(A224=\"\",\"\",VLOOKUP(A224,Tabela1[],2,0))","v":""},""]
[null,{"$f":"IF(A225=\"\",\"\",VLOOKUP(A225,Tabela1[],2,0))","v":""},""]
[null,{"$f":"IF(A226=\"\",\"\",VLOOKUP(A226,Tabela1[],2,0))","v":""},""]
[null,{"$f":"IF(A227=\"\",\"\",VLOOKUP(A227,Tabela1[],2,0))","v":""},""]
[null,{"$f":"IF(A228=\"\",\"\",VLOOKUP(A228,Tabela1[],2,0))","v":""},""]
[null,{"$f":"IF(A229=\"\",\"\",VLOOKUP(A229,Tabela1[],2,0))","v":""},""]
[null,{"$f":"IF(A230=\"\",\"\",VLOOKUP(A230,Tabela1[],2,0))","v":""},""]
[null,{"$f":"IF(A231=\"\",\"\",VLOOKUP(A231,Tabela1[],2,0))","v":""},""]
[null,{"$f":"IF(A232=\"\",\"\",VLOOKUP(A232,Tabela1[],2,0))","v":""},""]
[null,{"$f":"IF(A233=\"\",\"\",VLOOKUP(A233,Tabela1[],2,0))","v":""},""]
[null,{"$f":"IF(A234=\"\",\"\",VLOOKUP(A234,Tabela1[],2,0))","v":""},""]
[null,{"$f":"IF(A235=\"\",\"\",VLOOKUP(A235,Tabela1[],2,0))","v":""},""]
[null,{"$f":"IF(A236=\"\",\"\",VLOOKUP(A236,Tabela1[],2,0))","v":""},""]
[null,{"$f":"IF(A237=\"\",\"\",VLOOKUP(A237,Tabela1[],2,0))","v":""},""]
[null,{"$f":"IF(A238=\"\",\"\",VLOOKUP(A238,Tabela1[],2,0))","v":""},""]
[null,{"$f":"IF(A239=\"\",\"\",VLOOKUP(A239,Tabela1[],2,0))","v":""},""]
[null,{"$f":"IF(A240=\"\",\"\",VLOOKUP(A240,Tabela1[],2,0))","v":""},""]
[null,{"$f":"IF(A241=\"\",\"\",VLOOKUP(A241,Tabela1[],2,0))","v":""},""]
[null,{"$f":"IF(A242=\"\",\"\",VLOOKUP(A242,Tabela1[],2,0))","v":""},""]
[null,{"$f":"IF(A243=\"\",\"\",VLOOKUP(A243,Tabela1[],2,0))","v":""},""]
[null,{"$f":"IF(A244=\"\",\"\",VLOOKUP(A244,Tabela1[],2,0))","v":""},""]
[null,{"$f":"IF(A245=\"\",\"\",VLOOKUP(A245,Tabela1[],2,0))","v":""},""]
[null,{"$f":"IF(A246=\"\",\"\",VLOOKUP(A246,Tabela1[],2,0))","v":""},""]
[null,{"$f":"IF(A247=\"\",\"\",VLOOKUP(A247,Tabela1[],2,0))","v":""},""]
[null,{"$f":"IF(A248=\"\",\"\",VLOOKUP(A248,Tabela1[],2,0))","v":""},""]
[null,{"$f":"IF(A249=\"\",\"\",VLOOKUP(A249,Tabela1[],2,0))","v":""},""]
[null,{"$f":"IF(A250=\"\",\"\",VLOOKUP(A250,Tabela1[],2,0))","v":""},""]
[null,{"$f":"IF(A251=\"\",\"\",VLOOKUP(A251,Tabela1[],2,0))","v":""},""]
[null,{"$f":"IF(A252=\"\",\"\",VLOOKUP(A252,Tabela1[],2,0))","v":""},""]
[null,{"$f":"IF(A253=\"\",\"\",VLOOKUP(A253,Tabela1[],2,0))","v":""},""]
[null,{"$f":"IF(A254=\"\",\"\",VLOOKUP(A254,Tabela1[],2,0))","v":""},""]
[null,{"$f":"IF(A255=\"\",\"\",VLOOKUP(A255,Tabela1[],2,0))","v":""},""]
[null,{"$f":"IF(A256=\"\",\"\",VLOOKUP(A256,Tabela1[],2,0))","v":""},""]
[null,{"$f":"IF(A257=\"\",\"\",VLOOKUP(A257,Tabela1[],2,0))","v":""},""]
[null,{"$f":"IF(A258=\"\",\"\",VLOOKUP(A258,Tabela1[],2,0))","v":""},""]
[null,{"$f":"IF(A259=\"\",\"\",VLOOKUP(A259,Tabela1[],2,0))","v":""},""]
[null,{"$f":"IF(A260=\"\",\"\",VLOOKUP(A260,Tabela1[],2,0))","v":""},""]
[null,{"$f":"IF(A261=\"\",\"\",VLOOKUP(A261,Tabela1[],2,0))","v":""},""]
[null,{"$f":"IF(A262=\"\",\"\",VLOOKUP(A262,Tabela1[],2,0))","v":""},""]
[null,{"$f":"IF(A263=\"\",\"\",VLOOKUP(A263,Tabela1[],2,0))","v":""},""]
[null,{"$f":"IF(A264=\"\",\"\",VLOOKUP(A264,Tabela1[],2,0))","v":""},""]
[null,{"$f":"IF(A265=\"\",\"\",VLOOKUP(A265,Tabela1[],2,0))","v":""},""]
[null,{"$f":"IF(A266=\"\",\"\",VLOOKUP(A266,Tabela1[],2,0))","v":""},""]
[null,{"$f":"IF(A267=\"\",\"\",VLOOKUP(A267,Tabela1[],2,0))","v":""},""]
[null,{"$f":"IF(A268=\"\",\"\",VLOOKUP(A268,Tabela1[],2,0))","v":""},""]
[null,{"$f":"IF(A269=\"\",\"\",VLOOKUP(A269,Tabela1[],2,0))","v":""},""]
[null,{"$f":"IF(A270=\"\",\"\",VLOOKUP(A270,Tabela1[],2,0))","v":""},""]
[null,{"$f":"IF(A271=\"\",\"\",VLOOKUP(A271,Tabela1[],2,0))","v":""},""]
[null,{"$f":"IF(A272=\"\",\"\",VLOOKUP(A272,Tabela1[],2,0))","v":""},""]
[null,{"$f":"IF(A273=\"\",\"\",VLOOKUP(A273,Tabela1[],2,0))","v":""},""]
[null,{"$f":"IF(A274=\"\",\"\",VLOOKUP(A274,Tabela1[],2,0))","v":""},""]
[null,{"$f":"IF(A275=\"\",\"\",VLOOKUP(A275,Tabela1[],2,0))","v":""},""]
[null,{"$f":"IF(A276=\"\",\"\",VLOOKUP(A276,Tabela1[],2,0))","v":""},""]
[null,{"$f":"IF(A277=\"\",\"\",VLOOKUP(A277,Tabela1[],2,0))","v":""},""]
[null,{"$f":"IF(A278=\"\",\"\",VLOOKUP(A278,Tabela1[],2,0))","v":""},""]
[null,{"$f":"IF(A279=\"\",\"\",VLOOKUP(A279,Tabela1[],2,0))","v":""},""]
[null,{"$f":"IF(A280=\"\",\"\",VLOOKUP(A280,Tabela1[],2,0))","v":""},""]
[null,{"$f":"IF(A281=\"\",\"\",VLOOKUP(A281,Tabela1[],2,0))","v":""},""]
[null,{"$f":"IF(A282=\"\",\"\",VLOOKUP(A282,Tabela1[],2,0))","v":""},""]
[null,{"$f":"IF(A283=\"\",\"\",VLOOKUP(A283,Tabela1[],2,0))","v":""},""]
[null,{"$f":"IF(A284=\"\",\"\",VLOOKUP(A284,Tabela1[],2,0))","v":""},""]
[null,{"$f":"IF(A285=\"\",\"\",VLOOKUP(A285,Tabela1[],2,0))","v":""},""]
[null,{"$f":"IF(A286=\"\",\"\",VLOOKUP(A286,Tabela1[],2,0))","v":""},""]
[null,{"$f":"IF(A287=\"\",\"\",VLOOKUP(A287,Tabela1[],2,0))","v":""},""]
[null,{"$f":"IF(A288=\"\",\"\",VLOOKUP(A288,Tabela1[],2,0))","v":""},""]
[null,{"$f":"IF(A289=\"\",\"\",VLOOKUP(A289,Tabela1[],2,0))","v":""},""]
[null,{"$f":"IF(A290=\"\",\"\",VLOOKUP(A290,Tabela1[],2,0))","v":""},""]
[null,{"$f":"IF(A291=\"\",\"\",VLOOKUP(A291,Tabela1[],2,0))","v":""},""]
[null,{"$f":"IF(A292=\"\",\"\",VLOOKUP(A292,Tabela1[],2,0))","v":""},""]
[null,{"$f":"IF(A293=\"\",\"\",VLOOKUP(A293,Tabela1[],2,0))","v":""},""]
[null,{"$f":"IF(A294=\"\",\"\",VLOOKUP(A294,Tabela1[],2,0))","v":""},""]
[null,{"$f":"IF(A295=\"\",\"\",VLOOKUP(A295,Tabela1[],2,0))","v":""},""]
[null,{"$f":"IF(A296=\"\",\"\",VLOOKUP(A296,Tabela1[],2,0))","v":""},""]
[null,{"$f":"IF(A297=\"\",\"\",VLOOKUP(A297,Tabela1[],2,0))","v":""},""]
[null,{"$f":"IF(A298=\"\",\"\",VLOOKUP(A298,Tabela1[],2,0))","v":""},""]
[null,{"$f":"IF(A299=\"\",\"\",VLOOKUP(A299,Tabela1[],2,0))","v":""},""]
[null,{"$f":"IF(A300=\"\",\"\",VLOOKUP(A300,Tabela1[],2,0))","v":""},""]
[null,{"$f":"IF(A301=\"\",\"\",VLOOKUP(A301,Tabela1[],2,0))","v":""},""]
[null,{"$f":"IF(A302=\"\",\"\",VLOOKUP(A302,Tabela1[],2,0))","v":""},""]

{"sheet":"4_Advertencias e pontuacoes","index":3,"n_rows":113,"n_cols":7,"rows_kept":113,"cut":false,"hidden":false,"merged":[[1,1,2,6]]}
[]
[null,"Tabela 4. Critérios para classificação dos perigos de substâncias de acordo com o Sistema Global Harmonizado de Classificação e Rotulagem de substâncias e misturas (GHS), regulamentação (CE) n.º  1272/2008"]
[]
[]
[null,"Tipo de perigo","Código de perigo","Advertência de perigo","Pontuação S","Pontuação H","Pontuação E"]
[null,"FÍSICO","H200","Explosivo instável",2]
[null,null,"H201","Explosivo; perigo de explosão em massa",2]
[null,null,"H202","Explosivo; perigo grave de projeções",2]
[null,null,"H203","Explosivo; perigo de incêndio, sopro ou projeções",2]
[null,null,"H204","Perigo de incêndio ou projeções",1]
[null,null,"H205","Perigo de exposão em massa em caso de incêndio",2]
[null,null,"H206","Perigo de incêndio, explosão ou projecção; Aumento do risco de explosão se o agente dessensibilizante for reduzido",2]
[null,null,"H207","Perigo de fogo ou projeção; Aumento do risco de explosão se o agente dessensibilizante for reduzido",2]
[null,null,"H208","Risco de incêndio; Aumento do risco de explosão se o agente dessensibilizante for reduzido",2]
[null,null,"H220","Gás extremamente inflamável",2]
[null,null,"H221","Gás inflamável",1]
[null,null,"H222","Aerossol extremamente inflamável. Recipiente sob pressão: pode explodir se aquecido.",2]
[null,null,"H223","Aerossol inflamável. Recipiente sob pressão: pode explodir se aquecido.",1]
[null,null,"H224","Líquido e vapor extremamente inflamáveis",2]
[null,null,"H225","Líquido e vapor facilmente inflamáveis",2]
[null,null,"H226","Líquido e vapor inflamáveis",1]
[null,null,"H227","Líquido combustível",1]
[null,null,"H228 (cat. 1)","Sólido inflamável",2]
[null,null,"H228 (cat. 2)","Sólido inflamável",1]
[null,null,"H229","Recipiente sob pressão: pode explodir se aquecido.",1]
[null,null,"H230","Pode reagir explosivamente mesmo na ausência de ar",2]
[null,null,"H231","Pode reagir explosivamente mesmo na ausência de ar a temperatura e/ou pressão elevadas",1]
[null,null,"H232","Pode inflamar espontaneamente se exposto ao ar",2]
[null,null,"H240","Risco de explosão sob ação do calor",2]
[null,null,"H241","Risco de incêndio ou explosão sob ação do calor",2]
[null,null,"H242 (Tipo C & D)","Risco de incêndio sob ação do calor",2]
[null,null,"H242 (Tipo E & F)","Risco de incêndio sob a ação do calor",1]
[null,null,"H250","Risco de inflamação espontânea em contacto com o ar",2]
[null,null,"H251","Suscetível de auto-aquecimento; risco de inflamação",2]
[null,null,"H252","Suscetível de auto-aquecimento em grandes quantidades: risco de inflamação",1]
[null,null,"H260","Em contacto com a água liberta gases que se podem inflamar espontaneamente",2]
[null,null,"H261 (cat. 2)","Em contacto com a água liberta gases inflamáveis",2]
[null,null,"H261 (cat. 3)","Em contacto com a água liberta gases inflamáveis",1]
[null,null,"H270","Pode causar ou agravar o fogo; comburente",2]
[null,null,"H271","Risco de incêndio ou de explosão; muito comburente",2]
[null,null,"H272 (cat. 2)","Pode agravar incêndios; comburente",2]
[null,null,"H272 (cat. 3)","Pode agravar incêndios; comburente",1]
[null,null,"H280","Contém gas sob pressão; pode explodir se aquecido",1]
[null,null,"H281","Contém gas refrigerado; pode causar queimaduras ou lesões criogénicas",1]
[null,null,"H290","Pode ser corrosivo para os metais",1]
[null,null,"EUH001","Explosivo no estado seco",2]
[null,null,"EUH006","Perigo de explosão com ou sem contacto com o ar",2]
[null,null,"EUH014","Reage violentamente em contacto com a água",2]
[null,null,"EUH018","Pode formar mistura vapor-ar explosiva/inflamável durante a utilização",2]
[null,null,"EUH019","Pode formar peróxidos explosivos",2]
[null,null,"EUH044","Risco de explosão se aquecido em ambiente fechado",2]
[null,null,"EUH209","Pode tornar-se facilmente inflamável durante o uso",2]
[null,null,"EUH209A","Pode tornar-se inflamável durante o uso",1]
[null,"SAÚDE HUMANA","H300","Mortal por ingestão",null,2]
[null,null,"H301","Tóxico por ingestão",null,2]
[null,null,"H302","Nocivo por ingestão",null,1]
[null,null,"H303","Pode ser nocivo por ingestão",null,1]
[null,null,"H304","Pode ser mortal por ingestão e penetração nas vias respiratórias",null,2]
[null,null,"H305","Pode ser nocivo por ingestão e penetração nas vias respiratórias",null,1]
[null,null,"H310","Mortal em contacto com a pele",null,2]
[null,null,"H311","Tóxico em contacto com a pele",null,2]
[null,null,"H312","Nocivo em contacto com a pele",null,1]
[null,null,"H313","Pode ser nocivo em contacto com a pele",null,1]
[null,null,"H314","Provoca queimaduras na pele e lesões oculares graves",null,2]
[null,null,"H315","Provoca irritação cutânea",null,1]
[null,null,"H316","Provoca ligeira irritação cutânea ",null,1]
[null,null,"H317","Pode provocar uma reação alérgica cutânea",null,1]
[null,null,"H318","Provoca lesões oculares graves",null,2]
[null,null,"H319","Provoca irritação ocular grave",null,1]
[null,null,"H320","Provoca irritação ocular",null,1]
[null,null,"H330","Mortal por inalação",null,2]
[null,null,"H331","Tóxico por inalação",null,2]
[null,null,"H332","Nocivo por inalação",null,1]
[null,null,"H333","Pode ser nocivo por inalação",null,1]
[null,null,"H334","Quando inalado, pode provocar sintomas de alergia ou de asma ou dificuldades respiratórias",null,2]
[null,null,"H335","Pode provocar irritação das vias respiratórias",null,1]
[null,null,"H336","Pode provocar sonolência ou vertigens",null,1]
[null,null,"H340","Pode causar alterações genéticas",null,2]
[null,null,"H341","Suspeito de causar alterações genéticas",null,2]
[null,null,"H350","Pode provocar cancro",null,2]
[null,null,"H351","Suspeito de provocar cancro",null,2]
[null,null,"H360","Pode afectar a fertilidade ou o nascituro",null,2]
[null,null,"H361","Suspeito de afectar a fertilidade ou o nascituro",null,2]
[null,null,"H361f","Suspeito de afectar a fertilidade ou o nascituro",null,2]
[null,null,"H362","Pode ser nocivo para as crianças alimentadas com leite materno",null,1]
[null,null,"H370","Afeta os órgãos",null,2]
[null,null,"H371","Pode afetar os órgãos",null,2]
[null,null,"H372","Afecta os órgãos",null,2]
[null,null,"H373","Pode afectar os órgãos",null,2]
[null,null,"EUH029","Em contacto com a água liberta gases tóxicos",null,2]
[null,null,"EUH031","Em contacto com ácidos liberta gases tóxicos",null,2]
[null,null,"EUH032","Em contacto com ácidos liberta gases muito tóxicos",null,2]
[null,null,"EUH066","Pode provocar pele seca ou gretada por exposição repetida",null,1]
[null,null,"EUH070","Tóxico por contacto com os olhos",null,2]
[null,null,"EUH071","Corrosivo para as vias respiratórias",null,2]
[null,null,"EUH201","Contém chumbo. Não utilizar em superfícies que possam ser mordidas ou chupadas por crianças.",null,2]
[null,null,"EUH201A","Atenção! Contém chumbo.",null,1]
[null,null,"EUH202","Cianoacrilato. Perigo. Cola à pele e aos olhos em poucos segundos. Manter fora do alcance das crianças.",null,2]
[null,null,"EUH203","Contém crómio (VI). Pode provocar uma reacção alérgica.",null,1]
[null,null,"EUH204","Contém isocianatos. Ver as informações fornecidas pelo fabricante.",null,1]
[null,null,"EUH205","Contém componentes epoxídicos. Ver as informações fornecidas pelo fabricante.",null,1]
[null,null,"EUH206","Atenção! Não utilizar juntamente com outros produtos. Podem libertar-se gases perigosos (cloro).",null,2]
[null,null,"EUH207","Atenção! Contém cádmio. Libertam-se fumos perigosos durante a utilização. Ver as informações fornecidas pelo fabricante. Respeitar as instruções de segurança.",null,2]
[null,null,"EUH208","Contém (nome da substância sensibilizante em questão). Pode provocar uma reacção alérgica.",null,1]
[null,"AMBIENTE","H400","Muito tóxico para os organismos aquáticos",null,null,2]
[null,null,"H401","Tóxico para os organismos aquáticos",null,null,2]
[null,null,"H402","Nocivo para os organismos aquáticos",null,null,1]
[null,null,"H410","Muito tóxico para os organismos aquáticos com efeitos duradouros",null,null,2]
[null,null,"H411","Tóxico para os organismos aquáticos com efeitos duradouros",null,null,2]
[null,null,"H412","Nocivo para os organismos aquáticos com efeitos duradouros",null,null,1]
[null,null,"H413","Pode provocar efeitos nocivos duradouros nos organismos aquáticos",null,null,1]
[null,null,"H420","Prejudica a saúde pública e o ambiente ao destruir o ozono na atmosfera superior",null,null,2]
[null,null,"EUH059","Perigoso para a camada de ozono",null,null,2]

{"sheet":"defs triangulos","index":4,"n_rows":24,"n_cols":6,"rows_kept":24,"cut":false,"hidden":true,"merged":[[1,3,1,5],[1,2,2,2],[1,1,2,1]]}
[]
[null,null,"Substâncias","Perigos"]
[null,null,null,"H","E","S"]
[null,{"$f":"'2_Analise_SHE'!C5","v":"S1"},{"$f":"'3_Pontuação_Global_Substâncias'!B4","v":"1-Metilimidazol"},{"$f":"Tabela3[[#This Row],[H ]]","v":2},{"$f":"Tabela3[[#This Row],[E ]]","v":1},{"$f":"Tabela3[[#This Row],[S ]]","v":0}]
[null,{"$f":"'2_Analise_SHE'!C26","v":"S2"},{"$f":"'3_Pontuação_Global_Substâncias'!B5","v":"1-Clorohexano"},{"$f":"Tabela3[[#This Row],[H ]]","v":0},{"$f":"Tabela3[[#This Row],[E ]]","v":0},{"$f":"Tabela3[[#This Row],[S ]]","v":1}]
[null,{"$f":"'2_Analise_SHE'!$C$47","v":"S3"},{"$f":"'3_Pontuação_Global_Substâncias'!B6","v":"Éter dietílico"},{"$f":"Tabela3[[#This Row],[H ]]","v":1},{"$f":"Tabela3[[#This Row],[E ]]","v":0},{"$f":"Tabela3[[#This Row],[S ]]","v":2}]
[null,{"$f":"'2_Analise_SHE'!$C$68","v":"S4"},{"$f":"'3_Pontuação_Global_Substâncias'!B7","v":"Cloreto de 1-hexil-3-metilimidazólio"},{"$f":"Tabela3[[#This Row],[H ]]","v":0},{"$f":"Tabela3[[#This Row],[E ]]","v":0},{"$f":"Tabela3[[#This Row],[S ]]","v":0}]
[null,{"$f":"'2_Analise_SHE'!$C$89","v":"S5"},{"$f":"'3_Pontuação_Global_Substâncias'!B8","v":""},{"$f":"Tabela3[[#This Row],[H ]]","v":""},{"$f":"Tabela3[[#This Row],[E ]]","v":""},{"$f":"Tabela3[[#This Row],[S ]]","v":""}]
[null,{"$f":"'2_Analise_SHE'!$C$109","v":"S6"},{"$f":"'3_Pontuação_Global_Substâncias'!B9","v":""},{"$f":"Tabela3[[#This Row],[H ]]","v":""},{"$f":"Tabela3[[#This Row],[E ]]","v":""},{"$f":"Tabela3[[#This Row],[S ]]","v":""}]
[null,"S7",{"$f":"'3_Pontuação_Global_Substâncias'!B10","v":""},{"$f":"Tabela3[[#This Row],[H ]]","v":""},{"$f":"Tabela3[[#This Row],[E ]]","v":""},{"$f":"Tabela3[[#This Row],[S ]]","v":""}]
[null,"S8",{"$f":"'3_Pontuação_Global_Substâncias'!B11","v":""},{"$f":"Tabela3[[#This Row],[H ]]","v":""},{"$f":"Tabela3[[#This Row],[E ]]","v":""},{"$f":"Tabela3[[#This Row],[S ]]","v":""}]
[null,"S9",{"$f":"'3_Pontuação_Global_Substâncias'!B12","v":""},{"$f":"Tabela3[[#This Row],[H ]]","v":""},{"$f":"Tabela3[[#This Row],[E ]]","v":""},{"$f":"Tabela3[[#This Row],[S ]]","v":""}]
[null,"S10",{"$f":"'3_Pontuação_Global_Substâncias'!B13","v":""},{"$f":"Tabela3[[#This Row],[H ]]","v":""},{"$f":"Tabela3[[#This Row],[E ]]","v":""},{"$f":"Tabela3[[#This Row],[S ]]","v":""}]
[null,"S11",{"$f":"'3_Pontuação_Global_Substâncias'!B14","v":""},{"$f":"Tabela3[[#This Row],[H ]]","v":""},{"$f":"Tabela3[[#This Row],[E ]]","v":""},{"$f":"Tabela3[[#This Row],[S ]]","v":""}]
[null,"S12",{"$f":"'3_Pontuação_Global_Substâncias'!B15","v":""},{"$f":"Tabela3[[#This Row],[H ]]","v":""},{"$f":"Tabela3[[#This Row],[E ]]","v":""},{"$f":"Tabela3[[#This Row],[S ]]","v":""}]
[null,"S13",{"$f":"'3_Pontuação_Global_Substâncias'!B16","v":""},{"$f":"Tabela3[[#This Row],[H ]]","v":""},{"$f":"Tabela3[[#This Row],[E ]]","v":""},{"$f":"Tabela3[[#This Row],[S ]]","v":""}]
[null,"S14",{"$f":"'3_Pontuação_Global_Substâncias'!B17","v":""},{"$f":"Tabela3[[#This Row],[H ]]","v":""},{"$f":"Tabela3[[#This Row],[E ]]","v":""},{"$f":"Tabela3[[#This Row],[S ]]","v":""}]
[null,"S15",{"$f":"'3_Pontuação_Global_Substâncias'!B18","v":""},{"$f":"Tabela3[[#This Row],[H ]]","v":""},{"$f":"Tabela3[[#This Row],[E ]]","v":""},{"$f":"Tabela3[[#This Row],[S ]]","v":""}]
[null,"S16",{"$f":"'3_Pontuação_Global_Substâncias'!B19","v":""},{"$f":"Tabela3[[#This Row],[H ]]","v":""},{"$f":"Tabela3[[#This Row],[E ]]","v":""},{"$f":"Tabela3[[#This Row],[S ]]","v":""}]
[null,"S17",{"$f":"'3_Pontuação_Global_Substâncias'!B20","v":""},{"$f":"Tabela3[[#This Row],[H ]]","v":""},{"$f":"Tabela3[[#This Row],[E ]]","v":""},{"$f":"Tabela3[[#This Row],[S ]]","v":""}]
[null,"S18",{"$f":"'3_Pontuação_Global_Substâncias'!B21","v":""},{"$f":"Tabela3[[#This Row],[H ]]","v":""},{"$f":"Tabela3[[#This Row],[E ]]","v":""},{"$f":"Tabela3[[#This Row],[S ]]","v":""}]
[null,"S19",{"$f":"'3_Pontuação_Global_Substâncias'!B22","v":""},{"$f":"Tabela3[[#This Row],[H ]]","v":""},{"$f":"Tabela3[[#This Row],[E ]]","v":""},{"$f":"Tabela3[[#This Row],[S ]]","v":""}]
[null,"S20",{"$f":"'3_Pontuação_Global_Substâncias'!B23","v":""},{"$f":"Tabela3[[#This Row],[H ]]","v":""},{"$f":"Tabela3[[#This Row],[E ]]","v":""},{"$f":"Tabela3[[#This Row],[S ]]","v":""}]
[null,null,"Global",{"$f":"MAX(D4:D23)","v":2},{"$f":"MAX(E4:E23)","v":1},{"$f":"MAX(F4:F23)","v":2}]

{"sheet":"defs_ordenacao","index":5,"n_rows":109,"n_cols":5,"rows_kept":109,"cut":false,"hidden":true,"merged":[]}
["Código de perigo","Codigo numérico",null,"Codigo numérico","Código de perigo"]
["H200",1,null,1,"H200"]
["H201",2,null,2,"H201"]
["H202",3,null,3,"H202"]
["H203",4,null,4,"H203"]
["H204",5,null,5,"H204"]
["H205",6,null,6,"H205"]
["H206",7,null,7,"H206"]
["H207",8,null,8,"H207"]
["H208",9,null,9,"H208"]
["H220",10,null,10,"H220"]
["H221",11,null,11,"H221"]
["H222",12,null,12,"H222"]
["H223",13,null,13,"H223"]
["H224",14,null,14,"H224"]
["H225",15,null,15,"H225"]
["H226",16,null,16,"H226"]
["H227",17,null,17,"H227"]
["H228 (cat. 1)",18,null,18,"H228 (cat. 1)"]
["H228 (cat. 2)",19,null,19,"H228 (cat. 2)"]
["H229",20,null,20,"H229"]
["H230",21,null,21,"H230"]
["H231",22,null,22,"H231"]
["H232",23,null,23,"H232"]
["H240",24,null,24,"H240"]
["H241",25,null,25,"H241"]
["H242 (Tipo C & D)",26,null,26,"H242 (Tipo C & D)"]
["H242 (Tipo E & F)",27,null,27,"H242 (Tipo E & F)"]
["H250",28,null,28,"H250"]
["H251",29,null,29,"H251"]
["H252",30,null,30,"H252"]
["H260",31,null,31,"H260"]
["H261 (cat. 2)",32,null,32,"H261 (cat. 2)"]
["H261 (cat. 3)",33,null,33,"H261 (cat. 3)"]
["H270",34,null,34,"H270"]
["H271",35,null,35,"H271"]
["H272 (cat. 2)",36,null,36,"H272 (cat. 2)"]
["H272 (cat. 3)",37,null,37,"H272 (cat. 3)"]
["H280",38,null,38,"H280"]
["H281",39,null,39,"H281"]
["H290",40,null,40,"H290"]
["EUH001",41,null,41,"EUH001"]
["EUH006",42,null,42,"EUH006"]
["EUH014",43,null,43,"EUH014"]
["EUH018",44,null,44,"EUH018"]
["EUH019",45,null,45,"EUH019"]
["EUH044",46,null,46,"EUH044"]
["EUH209",47,null,47,"EUH209"]
["EUH209A",48,null,48,"EUH209A"]
["H300",49,null,49,"H300"]
["H301",50,null,50,"H301"]
["H302",51,null,51,"H302"]
["H303",52,null,52,"H303"]
["H304",53,null,53,"H304"]
["H305",54,null,54,"H305"]
["H310",55,null,55,"H310"]
["H311",56,null,56,"H311"]
["H312",57,null,57,"H312"]
["H313",58,null,58,"H313"]
["H314",59,null,59,"H314"]
["H315",60,null,60,"H315"]
["H316",61,null,61,"H316"]
["H317",62,null,62,"H317"]
["H318",63,null,63,"H318"]
["H319",64,null,64,"H319"]
["H320",65,null,65,"H320"]
["H330",66,null,66,"H330"]
["H331",67,null,67,"H331"]
["H332",68,null,68,"H332"]
["H333",69,null,69,"H333"]
["H334",70,null,70,"H334"]
["H335",71,null,71,"H335"]
["H336",72,null,72,"H336"]
["H340",73,null,73,"H340"]
["H341",74,null,74,"H341"]
["H350",75,null,75,"H350"]
["H351",76,null,76,"H351"]
["H360",77,null,77,"H360"]
["H361",78,null,78,"H361"]
["H361f",79,null,79,"H361f"]
["H362",80,null,80,"H362"]
["H370",81,null,81,"H370"]
["H371",82,null,82,"H371"]
["H372",83,null,83,"H372"]
["H373",84,null,84,"H373"]
["EUH029",85,null,85,"EUH029"]
["EUH031",86,null,86,"EUH031"]
["EUH032",87,null,87,"EUH032"]
["EUH066",88,null,88,"EUH066"]
["EUH070",89,null,89,"EUH070"]
["EUH071",90,null,90,"EUH071"]
["EUH201",91,null,91,"EUH201"]
["EUH201A",92,null,92,"EUH201A"]
["EUH202",93,null,93,"EUH202"]
["EUH203",94,null,94,"EUH203"]
["EUH204",95,null,95,"EUH204"]
["EUH205",96,null,96,"EUH205"]
["EUH206",97,null,97,"EUH206"]
["EUH207",98,null,98,"EUH207"]
["EUH208",99,null,99,"EUH208"]
["H400",100,null,100,"H400"]
["H401",101,null,101,"H401"]
["H402",102,null,102,"H402"]
["H410",103,null,103,"H410"]
["H411",104,null,104,"H411"]
["H412",105,null,105,"H412"]
["H413",106,null,106,"H413"]
["H420",107,null,107,"H420"]
["EUH059",108,null,108,"EUH059"]

{"sheet":"3_Pontuação_Global_Substâncias","index":6,"n_rows":24,"n_cols":7,"rows_kept":24,"cut":false,"hidden":true,"merged":[[0,1,0,4],[0,6,1,14]]}
[null,"Tabela 3. Pontuação global dos perigos das substâncias.",null,null,null,null,"Espetro de Perigos Potenciais (EPP) das substâncias"]
[null,null,"S (perigosidade física)","H (saúde humana)","E (ambiente)"]
[null,"Substância","S ","H ","E "]
[null,{"$f":"IF('2_Analise_SHE'!D5=\"\",\"\",'2_Analise_SHE'!D5)","v":"1-Metilimidazol"},{"$f":"IF(Tabela3[[#This Row],[Substância]]=\"\",\"\",'2_Analise_SHE'!E22)","v":0},{"$f":"IF(Tabela3[[#This Row],[Substância]]=\"\",\"\",'2_Analise_SHE'!F22)","v":2},{"$f":"IF(Tabela3[[#This Row],[Substância]]=\"\",\"\",'2_Analise_SHE'!G22)","v":1}]
[null,{"$f":"IF('2_Analise_SHE'!D26=\"\",\"\",'2_Analise_SHE'!D26)","v":"1-Clorohexano"},{"$f":"IF(Tabela3[[#This Row],[Substância]]=\"\",\"\",'2_Analise_SHE'!E43)","v":1},{"$f":"IF(Tabela3[[#This Row],[Substância]]=\"\",\"\",'2_Analise_SHE'!F43)","v":0},{"$f":"IF(Tabela3[[#This Row],[Substância]]=\"\",\"\",'2_Analise_SHE'!G43)","v":0}]
[null,{"$f":"IF('2_Analise_SHE'!D47=\"\",\"\",'2_Analise_SHE'!D47)","v":"Éter dietílico"},{"$f":"IF(Tabela3[[#This Row],[Substância]]=\"\",\"\",'2_Analise_SHE'!E64)","v":2},{"$f":"IF(Tabela3[[#This Row],[Substância]]=\"\",\"\",'2_Analise_SHE'!F64)","v":1},{"$f":"IF(Tabela3[[#This Row],[Substância]]=\"\",\"\",'2_Analise_SHE'!G64)","v":0}]
[null,{"$f":"IF('2_Analise_SHE'!D68=\"\",\"\",'2_Analise_SHE'!D68)","v":"Cloreto de 1-hexil-3-metilimidazólio"},{"$f":"IF(Tabela3[[#This Row],[Substância]]=\"\",\"\",'2_Analise_SHE'!E85)","v":0},{"$f":"IF(Tabela3[[#This Row],[Substância]]=\"\",\"\",'2_Analise_SHE'!F85)","v":0},{"$f":"IF(Tabela3[[#This Row],[Substância]]=\"\",\"\",'2_Analise_SHE'!G85)","v":0}]
[null,{"$f":"IF('2_Analise_SHE'!D89=\"\",\"\",'2_Analise_SHE'!D89)","v":""},{"$f":"IF(Tabela3[[#This Row],[Substância]]=\"\",\"\",'2_Analise_SHE'!E106)","v":""},{"$f":"IF(Tabela3[[#This Row],[Substância]]=\"\",\"\",'2_Analise_SHE'!F106)","v":""},{"$f":"IF(Tabela3[[#This Row],[Substância]]=\"\",\"\",'2_Analise_SHE'!G106)","v":""}]
[null,{"$f":"IF('2_Analise_SHE'!D109=\"\",\"\",'2_Analise_SHE'!D109)","v":""},{"$f":"IF(Tabela3[[#This Row],[Substância]]=\"\",\"\",'2_Analise_SHE'!E126)","v":""},{"$f":"IF(Tabela3[[#This Row],[Substância]]=\"\",\"\",'2_Analise_SHE'!F126)","v":""},{"$f":"IF(Tabela3[[#This Row],[Substância]]=\"\",\"\",'2_Analise_SHE'!G126)","v":""}]
[null,{"$f":"IF('2_Analise_SHE'!D129=\"\",\"\",'2_Analise_SHE'!D129)","v":""},{"$f":"IF(Tabela3[[#This Row],[Substância]]=\"\",\"\",'2_Analise_SHE'!E146)","v":""},{"$f":"IF(Tabela3[[#This Row],[Substância]]=\"\",\"\",'2_Analise_SHE'!F146)","v":""},{"$f":"IF(Tabela3[[#This Row],[Substância]]=\"\",\"\",'2_Analise_SHE'!G146)","v":""}]
[null,{"$f":"IF('2_Analise_SHE'!D149=\"\",\"\",'2_Analise_SHE'!D149)","v":""},{"$f":"IF(Tabela3[[#This Row],[Substância]]=\"\",\"\",'2_Analise_SHE'!E166)","v":""},{"$f":"IF(Tabela3[[#This Row],[Substância]]=\"\",\"\",'2_Analise_SHE'!F166)","v":""},{"$f":"IF(Tabela3[[#This Row],[Substância]]=\"\",\"\",'2_Analise_SHE'!G166)","v":""}]
[null,{"$f":"IF('2_Analise_SHE'!D169=\"\",\"\",'2_Analise_SHE'!D169)","v":""},{"$f":"IF(Tabela3[[#This Row],[Substância]]=\"\",\"\",'2_Analise_SHE'!E186)","v":""},{"$f":"IF(Tabela3[[#This Row],[Substância]]=\"\",\"\",'2_Analise_SHE'!F186)","v":""},{"$f":"IF(Tabela3[[#This Row],[Substância]]=\"\",\"\",'2_Analise_SHE'!G186)","v":""}]
[null,{"$f":"IF('2_Analise_SHE'!D189=\"\",\"\",'2_Analise_SHE'!D189)","v":""},{"$f":"IF(Tabela3[[#This Row],[Substância]]=\"\",\"\",'2_Analise_SHE'!E206)","v":""},{"$f":"IF(Tabela3[[#This Row],[Substância]]=\"\",\"\",'2_Analise_SHE'!F206)","v":""},{"$f":"IF(Tabela3[[#This Row],[Substância]]=\"\",\"\",'2_Analise_SHE'!G206)","v":""}]
[null,{"$f":"IF('2_Analise_SHE'!D209=\"\",\"\",'2_Analise_SHE'!D209)","v":""},{"$f":"IF(Tabela3[[#This Row],[Substância]]=\"\",\"\",'2_Analise_SHE'!E226)","v":""},{"$f":"IF(Tabela3[[#This Row],[Substância]]=\"\",\"\",'2_Analise_SHE'!F226)","v":""},{"$f":"IF(Tabela3[[#This Row],[Substância]]=\"\",\"\",'2_Analise_SHE'!G226)","v":""}]
[null,{"$f":"IF('2_Analise_SHE'!D229=\"\",\"\",'2_Analise_SHE'!D229)","v":""},{"$f":"IF(Tabela3[[#This Row],[Substância]]=\"\",\"\",'2_Analise_SHE'!E246)","v":""},{"$f":"IF(Tabela3[[#This Row],[Substância]]=\"\",\"\",'2_Analise_SHE'!F246)","v":""},{"$f":"IF(Tabela3[[#This Row],[Substância]]=\"\",\"\",'2_Analise_SHE'!G246)","v":""}]
[null,{"$f":"IF('2_Analise_SHE'!D249=\"\",\"\",'2_Analise_SHE'!D249)","v":""},{"$f":"IF(Tabela3[[#This Row],[Substância]]=\"\",\"\",'2_Analise_SHE'!E266)","v":""},{"$f":"IF(Tabela3[[#This Row],[Substância]]=\"\",\"\",'2_Analise_SHE'!F266)","v":""},{"$f":"IF(Tabela3[[#This Row],[Substância]]=\"\",\"\",'2_Analise_SHE'!G266)","v":""}]
[null,{"$f":"IF('2_Analise_SHE'!D269=\"\",\"\",'2_Analise_SHE'!D269)","v":""},{"$f":"IF(Tabela3[[#This Row],[Substância]]=\"\",\"\",'2_Analise_SHE'!E286)","v":""},{"$f":"IF(Tabela3[[#This Row],[Substância]]=\"\",\"\",'2_Analise_SHE'!F286)","v":""},{"$f":"IF(Tabela3[[#This Row],[Substância]]=\"\",\"\",'2_Analise_SHE'!G286)","v":""}]
[null,{"$f":"IF('2_Analise_SHE'!D289=\"\",\"\",'2_Analise_SHE'!D289)","v":""},{"$f":"IF(Tabela3[[#This Row],[Substância]]=\"\",\"\",'2_Analise_SHE'!E306)","v":""},{"$f":"IF(Tabela3[[#This Row],[Substância]]=\"\",\"\",'2_Analise_SHE'!F306)","v":""},{"$f":"IF(Tabela3[[#This Row],[Substância]]=\"\",\"\",'2_Analise_SHE'!G306)","v":""}]
[null,{"$f":"IF('2_Analise_SHE'!D309=\"\",\"\",'2_Analise_SHE'!D309)","v":""},{"$f":"IF(Tabela3[[#This Row],[Substância]]=\"\",\"\",'2_Analise_SHE'!E326)","v":""},{"$f":"IF(Tabela3[[#This Row],[Substância]]=\"\",\"\",'2_Analise_SHE'!F326)","v":""},{"$f":"IF(Tabela3[[#This Row],[Substância]]=\"\",\"\",'2_Analise_SHE'!G326)","v":""}]
[null,{"$f":"IF('2_Analise_SHE'!D329=\"\",\"\",'2_Analise_SHE'!D329)","v":""},{"$f":"IF(Tabela3[[#This Row],[Substância]]=\"\",\"\",'2_Analise_SHE'!E346)","v":""},{"$f":"IF(Tabela3[[#This Row],[Substância]]=\"\",\"\",'2_Analise_SHE'!F346)","v":""},{"$f":"IF(Tabela3[[#This Row],[Substância]]=\"\",\"\",'2_Analise_SHE'!G346)","v":""}]
[null,{"$f":"IF('2_Analise_SHE'!D349=\"\",\"\",'2_Analise_SHE'!D349)","v":""},{"$f":"IF(Tabela3[[#This Row],[Substância]]=\"\",\"\",'2_Analise_SHE'!E366)","v":""},{"$f":"IF(Tabela3[[#This Row],[Substância]]=\"\",\"\",'2_Analise_SHE'!F366)","v":""},{"$f":"IF(Tabela3[[#This Row],[Substância]]=\"\",\"\",'2_Analise_SHE'!G366)","v":""}]
[null,{"$f":"IF('2_Analise_SHE'!D369=\"\",\"\",'2_Analise_SHE'!D369)","v":""},{"$f":"IF(Tabela3[[#This Row],[Substância]]=\"\",\"\",'2_Analise_SHE'!E386)","v":""},{"$f":"IF(Tabela3[[#This Row],[Substância]]=\"\",\"\",'2_Analise_SHE'!F386)","v":""},{"$f":"IF(Tabela3[[#This Row],[Substância]]=\"\",\"\",'2_Analise_SHE'!G386)","v":""}]
[null,{"$f":"IF('2_Analise_SHE'!D389=\"\",\"\",'2_Analise_SHE'!D389)","v":""},{"$f":"IF(Tabela3[[#This Row],[Substância]]=\"\",\"\",'2_Analise_SHE'!E406)","v":""},{"$f":"IF(Tabela3[[#This Row],[Substância]]=\"\",\"\",'2_Analise_SHE'!F406)","v":""},{"$f":"IF(Tabela3[[#This Row],[Substância]]=\"\",\"\",'2_Analise_SHE'!G406)","v":""}]
[null,"Global",{"$f":"MAX(C4:C23)","v":2},{"$f":"MAX(D4:D23)","v":2},{"$f":"MAX(E4:E23)","v":1}]